Dipropyl oxalate
- Formula: C8H14O4
- Molecular weight: 174.1944
- IUPAC Standard InChIKey: HZHMMLIMOUNKCK-UHFFFAOYSA-N
- CAS Registry Number: 615-98-5
- Chemical structure:
View 3d structure (requires JavaScript / HTML 5) - Other names: Di-n-propyl oxalate

Phase change data

Data compiled as indicated in comments:
TRC - Thermodynamics Research Center, NIST Boulder Laboratories, Chris Muzny director
AC - William E. Acree, Jr., James S. Chickos
Quantity | Value | Units | Method | Reference | Comment |
---|---|---|---|---|---|
Tboil | 487.1 | K | N/A | Timmermans, 1927 | Uncertainty assigned by TRC = 0.5 K; source of data not clear; TRC |
Enthalpy of vaporization
ΔvapH (kJ/mol) | Temperature (K) | Method | Reference | Comment |
---|---|---|---|---|
57.8 | 341. | A | Stephenson and Malanowski, 1987 | Based on data from 326. to 487. K. See also Stull, 1947.; AC |
Antoine Equation Parameters
log10(P) = A − (B / (T + C))
P = vapor pressure (bar)
T = temperature (K)
View plot Requires a JavaScript / HTML 5 canvas capable browser.
Temperature (K) | A | B | C | Reference | Comment |
---|---|---|---|---|---|
326.6 to 486.7 | 5.1117 | 2266.717 | -42.632 | Stull, 1947 | Coefficents calculated by NIST from author's data. |

References

Timmermans, 1927
Timmermans, J.,
The Melting Point of Organic Substances,
Bull. Soc. Chim. Belg., 1927, 36, 502. [all data]
Stephenson and Malanowski, 1987
Stephenson, Richard M.; Malanowski, Stanislaw,
Handbook of the Thermodynamics of Organic Compounds, 1987, https://doi.org/10.1007/978-94-009-3173-2
. [all data]
Stull, 1947
Stull, Daniel R.,
Vapor Pressure of Pure Substances. Organic and Inorganic Compounds,
Ind. Eng. Chem., 1947, 39, 4, 517-540, https://doi.org/10.1021/ie50448a022
. [all data]