Naphthalene, 1-(1-methylethyl)-
- Formula: C13H14
- Molecular weight: 170.2503
- IUPAC Standard InChIKey: PMPBFICDXLLSRM-UHFFFAOYSA-N
- CAS Registry Number: 6158-45-8
- Chemical structure:
View 3d structure (requires JavaScript / HTML 5) - Species with the same structure:
- Other names: α-Isopropylnaphthalene; Naphthalene, 1-isopropyl-; 1-Isopropylnaphthalene

Phase change data

Data compiled as indicated in comments:
BS - Robert L. Brown and Stephen E. Stein
TRC - Thermodynamics Research Center, NIST Boulder Laboratories, Chris Muzny director
AC - William E. Acree, Jr., James S. Chickos
Quantity | Value | Units | Method | Reference | Comment |
---|---|---|---|---|---|
Tboil | 539. ± 5. | K | AVG | N/A | Average of 6 values; Individual data points |
Quantity | Value | Units | Method | Reference | Comment |
Tfus | 257.49 | K | N/A | Hipsher and Wise, 1954 | Uncertainty assigned by TRC = 0.1 K; TRC |
Reduced pressure boiling point
Tboil (K) | Pressure (bar) | Reference | Comment |
---|---|---|---|
405.2 | 0.016 | Weast and Grasselli, 1989 | BS |
Enthalpy of vaporization
ΔvapH (kJ/mol) | Temperature (K) | Method | Reference | Comment |
---|---|---|---|---|
50.4 | 417. | A | Stephenson and Malanowski, 1987 | Based on data from 402. to 541. K.; AC |

References

Hipsher and Wise, 1954
Hipsher, H.F.; Wise, P.H.,
Dicyclic Hydrocarbons VIII. 1-Alkylnaphthalenes and Some of Their Tetrahydro Derivatives,
J. Am. Chem. Soc., 1954, 76, 1747-8. [all data]
Weast and Grasselli, 1989
CRC Handbook of Data on Organic Compounds, 2nd Editon, Weast,R.C and Grasselli, J.G., ed(s)., CRC Press, Inc., Boca Raton, FL, 1989, 1. [all data]
Stephenson and Malanowski, 1987
Stephenson, Richard M.; Malanowski, Stanislaw,
Handbook of the Thermodynamics of Organic Compounds, 1987, https://doi.org/10.1007/978-94-009-3173-2
. [all data]