N-dl-Leucylglycine
- Formula: C8H16N2O3
- Molecular weight: 188.2242
- IUPAC Standard InChIKey: LESXFEZIFXFIQR-UHFFFAOYSA-N
- CAS Registry Number: 615-82-7
- Chemical structure:
View 3d structure (requires JavaScript / HTML 5) - Other names: dl-Leucylglycine; Glycine, N-DL-leucyl-

Condensed phase thermochemistry data

Data compiled as indicated in comments:
ALS - Hussein Y. Afeefy, Joel F. Liebman, and Stephen E. Stein
DH - Eugene S. Domalski and Elizabeth D. Hearing
Quantity | Value | Units | Method | Reference | Comment |
---|---|---|---|---|---|
ΔfH°solid | -859.9 ± 1.3 | kJ/mol | Ccb | Huffman, 1942 | Heat of combustion corrected for pressure; ALS |
Quantity | Value | Units | Method | Reference | Comment |
ΔcH°solid | -4574.8 ± 1.2 | kJ/mol | Ccb | Huffman, 1942 | Heat of combustion corrected for pressure; ALS |
ΔcH°solid | -4586.6 ± 0.6 | kJ/mol | Ccb | Wrede, 1911 | ALS |
Quantity | Value | Units | Method | Reference | Comment |
S°solid,1 bar | 281.2 | J/mol*K | N/A | Huffman, 1941 | Extrapolation below 90 K, 82.47 J/mol*K.; DH |
Constant pressure heat capacity of solid
Cp,solid (J/mol*K) | Temperature (K) | Reference | Comment |
---|---|---|---|
255.64 | 297.1 | Huffman, 1941 | T = 86 to 297 K. Value is unsmoothed experimental datum.; DH |

References

Huffman, 1942
Huffman, H.M.,
Thermal data. XV. The heats of combustion and free energies of some compounds containing the peptide bond,
J. Phys. Chem., 1942, 46, 885-891. [all data]
Wrede, 1911
Wrede, F.,
Uber die Bestimmung von Berbrennungswarmen mittels der kalorimetrischen Bombe unter Benutzung des Platinwiderstandsthermometers,
Z. Phys. Chem. (Leipzig), 1911, 81-94. [all data]
Huffman, 1941
Huffman, H.M.,
Thermal data. XIV. The heat capacities and entropies of some compounds having the peptide bond,
J. Am. Chem. Soc., 1941, 63, 688-689. [all data]