Phenol, 2-chloro-5-methyl-
- Formula: C7H7ClO
- Molecular weight: 142.583
- IUPAC Standard InChIKey: SMFHPCZZAAMJJO-UHFFFAOYSA-N
- CAS Registry Number: 615-74-7
- Chemical structure:
View 3d structure (requires JavaScript / HTML 5) - Other names: m-Cresol, 6-chloro-; 2-Chloro-5-methylphenol; 3-Methyl-6-chlorophenol; 5-Methyl-2-chlorophenol; 6-Chloro-m-cresol; 6-Chloro-3-methylphenol

Phase change data

Data compiled as indicated in comments:
BS - Robert L. Brown and Stephen E. Stein
TRC - Thermodynamics Research Center, NIST Boulder Laboratories, Chris Muzny director
Quantity | Value | Units | Method | Reference | Comment |
---|---|---|---|---|---|
Tboil | 469.2 | K | N/A | Weast and Grasselli, 1989 | BS |
Tboil | 471. | K | N/A | Huston and Chen, 1933 | Uncertainty assigned by TRC = 5. K; TRC |
Quantity | Value | Units | Method | Reference | Comment |
Tfus | 319.2 | K | N/A | Huston and Chen, 1933 | Uncertainty assigned by TRC = 3. K; TRC |

Van Den Dool and Kratz RI, non-polar column, custom temperature program

Column type | Active phase | I | Reference | Comment |
---|---|---|---|---|
Capillary | VF-5MS | 1111.2 | Tret'yakov, 2007 | 30. m/0.25 mm/0.25 μm, He; Program: Multi-step temperature program; T(initial)=60C; T(final)=270C |

References

Weast and Grasselli, 1989
CRC Handbook of Data on Organic Compounds, 2nd Editon, Weast,R.C and Grasselli, J.G., ed(s)., CRC Press, Inc., Boca Raton, FL, 1989, 1. [all data]
Huston and Chen, 1933
Huston, R.C.; Chen, P.S.,
The Chloro Derivatives of m-Cresol,
J. Am. Chem. Soc., 1933, 55, 4214-25. [all data]
Tret'yakov, 2007
Tret'yakov, K.V.,
Retention Data. NIST Mass Spectrometry Data Center., NIST Mass Spectrometry Data Center, 2007. [all data]