Phenol, 2,4-dibromo-
- Formula: C6H4Br2O
- Molecular weight: 251.903
- IUPAC Standard InChIKey: FAXWFCTVSHEODL-UHFFFAOYSA-N
- CAS Registry Number: 615-58-7
- Chemical structure:
View 3d structure (requires JavaScript / HTML 5) - Other names: 2,4-Dibromophenol; DBP; Emery 9331; FR-612

Condensed phase thermochemistry data

Data compiled by: Eugene S. Domalski and Elizabeth D. Hearing
Constant pressure heat capacity of liquid
Cp,liquid (J/mol*K) | Temperature (K) | Reference | Comment |
---|---|---|---|
260. | ~313. | Werner, 1884 | T = 18.5 - 73°C, mean value for supercooled liquid. |

Phase change data

Data compiled as indicated in comments:
BS - Robert L. Brown and Stephen E. Stein
TRC - Thermodynamics Research Center, NIST Boulder Laboratories, Chris Muzny director
AC - William E. Acree, Jr., James S. Chickos
DH - Eugene S. Domalski and Elizabeth D. Hearing
Quantity | Value | Units | Method | Reference | Comment |
---|---|---|---|---|---|
Tfus | 313. | K | N/A | Werner, 1884, 2 | Uncertainty assigned by TRC = 2. K; TRC |
Reduced pressure boiling point
Tboil (K) | Pressure (bar) | Reference | Comment |
---|---|---|---|
427.2 | 0.015 | Aldrich Chemical Company Inc., 1990 | BS |
Enthalpy of fusion
ΔfusH (kJ/mol) | Temperature (K) | Reference | Comment |
---|---|---|---|
14.64 | 313. | Acree, 1991 | AC |
15.000 | 313. | Werner, 1884 | DH |
Entropy of fusion
ΔfusS (J/mol*K) | Temperature (K) | Reference | Comment |
---|---|---|---|
46. | 313. | Werner, 1884 | DH |

References

Werner, 1884
Werner, E.,
Recherches sur les phenols bromes,
Ann. chim. phys. [6], 1884, 3, 567-574. [all data]
Werner, 1884, 2
Werner, E.,
Research on Bromo Phenols,
Ann. Chim. Phys., 1884, 3, 567. [all data]
Aldrich Chemical Company Inc., 1990
Aldrich Chemical Company Inc.,
Catalog Handbook of Fine Chemicals, Aldrich Chemical Company, Inc., Milwaukee WI, 1990, 1. [all data]
Acree, 1991
Acree, William E.,
Thermodynamic properties of organic compounds: enthalpy of fusion and melting point temperature compilation,
Thermochimica Acta, 1991, 189, 1, 37-56, https://doi.org/10.1016/0040-6031(91)87098-H
. [all data]