5-Amino-2-methyl-2H-tetrazole
- Formula: C2H5N5
- Molecular weight: 99.0946
- IUPAC Standard InChIKey: AZUKLCJYWVMPML-UHFFFAOYSA-N
- CAS Registry Number: 6154-04-7
- Chemical structure:
View 3d structure (requires JavaScript / HTML 5) - Other names: 2-Methyl-5-aminotetrazole; 2H-Tetrazol-5-amine, 2-methyl-; 2H-Tetrazole, 5-amino-2-methyl-; 5-Amino-2-methyltetrazole; 2-Methyl-5-tetrazolamine

Gas phase thermochemistry data

Data compiled as indicated in comments:
ALS - Hussein Y. Afeefy, Joel F. Liebman, and Stephen E. Stein
DRB - Donald R. Burgess, Jr.
Quantity | Value | Units | Method | Reference | Comment |
---|---|---|---|---|---|
ΔfH°gas | 298.8 ± 2.8 | kJ/mol | Ccb | Kozyro, Simirskii, et al., 1990 | ALS |
ΔfH°gas | 302.9 | kJ/mol | N/A | Williams, McEwan, et al., 1957 | Value computed using ΔfHsolid° value of 210.9 kj/mol from Williams, McEwan, et al., 1957 and ΔsubH° value of 92.0 kj/mol from Kozyro, Simirskii, et al., 1990.; DRB |

Condensed phase thermochemistry data

Data compiled by: Hussein Y. Afeefy, Joel F. Liebman, and Stephen E. Stein
Quantity | Value | Units | Method | Reference | Comment |
---|---|---|---|---|---|
ΔfH°solid | 206.8 ± 2.6 | kJ/mol | Ccb | Kozyro, Simirskii, et al., 1990 | |
ΔfH°solid | 210.9 | kJ/mol | Ccb | Williams, McEwan, et al., 1957 | |
Quantity | Value | Units | Method | Reference | Comment |
ΔcH°solid | -1708.4 ± 2.5 | kJ/mol | Ccb | Kozyro, Simirskii, et al., 1990 | |
ΔcH°solid | -1712.5 ± 2.1 | kJ/mol | Ccb | Williams, McEwan, et al., 1957 |

Phase change data

Data compiled as indicated in comments:
TRC - Thermodynamics Research Center, NIST Boulder Laboratories, Chris Muzny director
ALS - Hussein Y. Afeefy, Joel F. Liebman, and Stephen E. Stein
DRB - Donald R. Burgess, Jr.
AC - William E. Acree, Jr., James S. Chickos
Quantity | Value | Units | Method | Reference | Comment |
---|---|---|---|---|---|
Ttriple | 382. | K | N/A | Vorob'eva, 1990 | Uncertainty assigned by TRC = 1. K; TRC |
Quantity | Value | Units | Method | Reference | Comment |
ΔsubH° | 92.0 ± 1.1 | kJ/mol | V | Kozyro, Simirskii, et al., 1990 | ALS |
ΔsubH° | 92.0 | kJ/mol | N/A | Kozyro, Simirskii, et al., 1990 | DRB |
Enthalpy of sublimation
ΔsubH (kJ/mol) | Temperature (K) | Method | Reference | Comment |
---|---|---|---|---|
90.6 ± 1.1 | 310. to 373. | ME | Kozyro, Simirskii, et al., 1990, 2 | AC |

References

Kozyro, Simirskii, et al., 1990
Kozyro, A.A.; Simirskii, V.V.; Krasulin, A.P.; Sevruk, V.M.; Kabo, G.Ya.; Frenkel, M.L.; Gaponik, P.N.; Grigor'ev, Yu.V.,
Thermodynamic properties of tetrazole derivatives in different aggregation states,
Russ. J. Phys. Chem. (Engl. Transl.), 1990, 64, 348-350. [all data]
Williams, McEwan, et al., 1957
Williams, M.M.; McEwan, W.S.; Henry, R.A.,
The heats of combustion of substituted triazoles, tetrazoles and related high nitrogen compounds,
J. Phys. Chem., 1957, 61, 261-267. [all data]
Vorob'eva, 1990
Vorob'eva, V.P.,
Enthalpies of phase transitions of tetrazole derivatives
in Vses. Konf. Term. Org. Soedin. 6th, Minsk, p 31, 1990. [all data]
Kozyro, Simirskii, et al., 1990, 2
Kozyro, A.A.; Simirskii, V.V.; Krasulin, A.P.; Sevruk, V.M.; Kabo, G.Y.; Frenkel, M.L.; Gaponik, P.N.; Grigor'ev, Y.V.,
Russ. J. Phys. Chem., 1990, 64, 348. [all data]