Cyclohexanol, 2-methyl-, trans-(.+/-.)-

Phase change data

Data compiled by: Robert L. Brown and Stephen E. Stein

Quantity Value Units Method Reference Comment
Tboil439.2KN/AWeast and Grasselli, 1989

Reduced pressure boiling point

Tboil (K) Pressure (atm) Reference
351.20.026Weast and Grasselli, 1989

References

Weast and Grasselli, 1989
CRC Handbook of Data on Organic Compounds, 2nd Editon, Weast,R.C and Grasselli, J.G., ed(s)., CRC Press, Inc., Boca Raton, FL, 1989, 1. [all data]