2H-Inden-2-one, 1,3-dihydro-
- Formula: C9H8O
- Molecular weight: 132.1592
- IUPAC Standard InChIKey: UMJJFEIKYGFCAT-UHFFFAOYSA-N
- CAS Registry Number: 615-13-4
- Chemical structure:
View 3d structure (requires JavaScript / HTML 5) - Other names: 2-Indanone; 1,3-Dihydro-2H-inden-2-one; β-Hydrindone; Indanone; indan-2-one

Phase change data

Data compiled as indicated in comments:
TRC - Thermodynamics Research Center, NIST Boulder Laboratories, Chris Muzny director
AC - William E. Acree, Jr., James S. Chickos
Quantity | Value | Units | Method | Reference | Comment |
---|---|---|---|---|---|
Tfus | 331. | K | N/A | Huckel and Wenzke, 1944 | Uncertainty assigned by TRC = 3. K; TRC |
Quantity | Value | Units | Method | Reference | Comment |
ΔsubH° | 78.3 ± 1.1 | kJ/mol | C | Matos, Miranda, et al., 2007 | AC |
Enthalpy of fusion
ΔfusH (kJ/mol) | Temperature (K) | Method | Reference | Comment |
---|---|---|---|---|
16.89 | 330. | DSC | Matos, Miranda, et al., 2007 | AC |

Reaction thermochemistry data

Data compiled by: John E. Bartmess
Individual Reactions
C9H7O- + =
By formula: C9H7O- + H+ = C9H8O
Quantity | Value | Units | Method | Reference | Comment |
---|---|---|---|---|---|
ΔrH° | 1469. ± 8.8 | kJ/mol | G+TS | Taft, 1991 | gas phase |
Quantity | Value | Units | Method | Reference | Comment |
ΔrG° | 1437. ± 8.4 | kJ/mol | IMRE | Taft, 1991 | gas phase |

Gas phase ion energetics data

Data compiled by: John E. Bartmess
De-protonation reactions
C9H7O- + =
By formula: C9H7O- + H+ = C9H8O
Quantity | Value | Units | Method | Reference | Comment |
---|---|---|---|---|---|
ΔrH° | 1469. ± 8.8 | kJ/mol | G+TS | Taft, 1991 | gas phase |
Quantity | Value | Units | Method | Reference | Comment |
ΔrG° | 1437. ± 8.4 | kJ/mol | IMRE | Taft, 1991 | gas phase |

References

Huckel and Wenzke, 1944
Huckel, W.; Wenzke, U.,
The Association of Aromatic Alcohols,
Z. Phys. Chem. (Leipzig), 1944, 193, 132-61. [all data]
Matos, Miranda, et al., 2007
Matos, M. Agostinha R.; Miranda, Margarida S.; Pereira, Susana M.M.; Morais, Victor M.F.; Liebman, Joel F.,
The Experimental and Calculational Thermochemistry of 1,2,4,5-Benzenetetracarboxylic Dianhydride: Is This 10 π Multiring Species Aromatic?,
J. Phys. Chem. A, 2007, 111, 30, 7181-7188, https://doi.org/10.1021/jp071625n
. [all data]
Taft, 1991
Taft, R.W.,
, personal communication, Aug, 1991. [all data]