1H-Indole, 5-methyl-
- Formula: C9H9N
- Molecular weight: 131.1745
- IUPAC Standard InChIKey: YPKBCLZFIYBSHK-UHFFFAOYSA-N
- CAS Registry Number: 614-96-0
- Chemical structure:

Phase change data

Data compiled by: Robert L. Brown and Stephen E. Stein
Quantity | Value | Units | Method | Reference | Comment |
---|---|---|---|---|---|
Tboil | 540.2 | K | N/A | Weast and Grasselli, 1989 |

References

Weast and Grasselli, 1989
CRC Handbook of Data on Organic Compounds, 2nd Editon, Weast,R.C and Grasselli, J.G., ed(s)., CRC Press, Inc., Boca Raton, FL, 1989, 1. [all data]