2-Pentanol, 4,4-dimethyl-
- Formula: C7H16O
- Molecular weight: 116.2013
- IUPAC Standard InChIKey: OIBKGNPMOMMSSI-UHFFFAOYSA-N
- CAS Registry Number: 6144-93-0
- Chemical structure:

Phase change data

Data compiled as indicated in comments:
TRC - Thermodynamics Research Center, NIST Boulder Laboratories, Chris Muzny director
BS - Robert L. Brown and Stephen E. Stein
Quantity | Value | Units | Method | Reference | Comment |
---|---|---|---|---|---|
Tboil | 410.65 | K | N/A | Shiner, Boskin, et al., 1955 | Uncertainty assigned by TRC = 3. K; TRC |
Tboil | 411.15 | K | N/A | Cook, 1952 | Uncertainty assigned by TRC = 2. K; TRC |
Reduced pressure boiling point
Tboil (K) | Pressure (bar) | Reference | Comment |
---|---|---|---|
410.5 | 0.981 | Aldrich Chemical Company Inc., 1990 | BS |

Reaction thermochemistry data

Data compiled by: John E. Bartmess
Individual Reactions
C7H15O- + =
By formula: C7H15O- + H+ = C7H16O
Quantity | Value | Units | Method | Reference | Comment |
---|---|---|---|---|---|
ΔrH° | 1553. ± 8.4 | kJ/mol | CIDC | Haas and Harrison, 1993 | gas phase; Both metastable and 50 eV collision energy. |
Quantity | Value | Units | Method | Reference | Comment |
ΔrG° | 1525. ± 8.8 | kJ/mol | H-TS | Haas and Harrison, 1993 | gas phase; Both metastable and 50 eV collision energy. |

Gas phase ion energetics data

Data compiled as indicated in comments:
B - John E. Bartmess
LL - Sharon G. Lias and Joel F. Liebman
Appearance energy determinations
Ion | AE (eV) | Other Products | Method | Reference | Comment |
---|---|---|---|---|---|
C2H5O+ | 10.35 | (CH3)3CCH2 | EI | Holmes, Lossing, et al., 1988 | LL |
De-protonation reactions
C7H15O- + =
By formula: C7H15O- + H+ = C7H16O
Quantity | Value | Units | Method | Reference | Comment |
---|---|---|---|---|---|
ΔrH° | 371.1 ± 2.0 | kcal/mol | CIDC | Haas and Harrison, 1993 | gas phase; Both metastable and 50 eV collision energy.; B |
Quantity | Value | Units | Method | Reference | Comment |
ΔrG° | 364.5 ± 2.1 | kcal/mol | H-TS | Haas and Harrison, 1993 | gas phase; Both metastable and 50 eV collision energy.; B |

Van Den Dool and Kratz RI, polar column, temperature ramp

Column type | Active phase | I | Reference | Comment |
---|---|---|---|---|
Capillary | Carbowax | 1219.9 | Censullo, Jones, et al., 2003 | 60. m/0.25 mm/0.5 μm, He, 50. C @ 10. min, 5. K/min, 250. C @ 10. min |

References

Shiner, Boskin, et al., 1955
Shiner, V.J.; Boskin, M.J.; Smith, M.L.,
J. Am. Chem. Soc., 1955, 77, 5525. [all data]
Cook, 1952
Cook, N.C.,
, Unpublished, Final Rep. Stand. Proj. on Oxygenated Compounds, Penn. State Univ., College Park, PA, 1952. [all data]
Aldrich Chemical Company Inc., 1990
Aldrich Chemical Company Inc.,
Catalog Handbook of Fine Chemicals, Aldrich Chemical Company, Inc., Milwaukee WI, 1990, 1. [all data]
Haas and Harrison, 1993
Haas, M.J.; Harrison, A.G.,
The Fragmentation of Proton-Bound Cluster Ions and the Gas-Phase Acidities of Alcohols,
Int. J. Mass Spectrom. Ion Proc., 1993, 124, 2, 115, https://doi.org/10.1016/0168-1176(93)80003-W
. [all data]