2-Propen-1-one, 1,3-diphenyl-, (E)-
- Formula: C15H12O
- Molecular weight: 208.2552
- IUPAC Standard InChIKey: DQFBYFPFKXHELB-VAWYXSNFSA-N
- CAS Registry Number: 614-47-1
- Chemical structure:
View 3d structure (requires JavaScript / HTML 5) - Stereoisomers:
- Other names: trans-Chalcone; trans-Benzalacetophenone; (E)-Chalcone; Phenyl (E)-2-phenylethenyl ketone; Phenyl trans-styryl ketone; Benzalacetophenone

Phase change data

Data compiled by: Robert L. Brown and Stephen E. Stein
Reduced pressure boiling point
Tboil (K) | Pressure (bar) | Reference |
---|---|---|
481.2 | 0.033 | Aldrich Chemical Company Inc., 1990 |

Reaction thermochemistry data

Data compiled by: Hussein Y. Afeefy, Joel F. Liebman, and Stephen E. Stein
Individual Reactions
By formula: H2 + C15H12O = C15H14O
Quantity | Value | Units | Method | Reference | Comment |
---|---|---|---|---|---|
ΔrH° | -391. | kJ/mol | Chyd | Veselova and Sul'man, 1980 | liquid phase |

References

Aldrich Chemical Company Inc., 1990
Aldrich Chemical Company Inc.,
Catalog Handbook of Fine Chemicals, Aldrich Chemical Company, Inc., Milwaukee WI, 1990, 1. [all data]
Veselova and Sul'man, 1980
Veselova, M.E.; Sul'man, E.M.,
Effect of the chemical structure of α,β-unsaturated esters and ketones on the selectivity of their hydrogenation,
Svoistva Veshchestv i Stroenie Molekul, Kalinin, 1980, 140-143. [all data]
Lang (editor), 1961
Lang (editor), L.,
Absorption Spectra in the Ultraviolet and Visible Region, 1961, 2, 233. [all data]