3,4'-Diisopropylbiphenyl
- Formula: C18H22
- Molecular weight: 238.3673
- IUPAC Standard InChIKey: LHNUPUGVRFQTLK-UHFFFAOYSA-N
- CAS Registry Number: 61434-46-6
- Chemical structure:

Reaction thermochemistry data

Data compiled by: Hussein Y. Afeefy, Joel F. Liebman, and Stephen E. Stein
Individual Reactions
By formula: C18H22 = C18H22
Quantity | Value | Units | Method | Reference | Comment |
---|---|---|---|---|---|
ΔrH° | -0.6 ± 1.6 | kJ/mol | Eqk | Roshchupkina, Nesterova, et al., 1987 | liquid phase; T=367.5 K |
By formula: C18H22 = C18H22
Quantity | Value | Units | Method | Reference | Comment |
---|---|---|---|---|---|
ΔrH° | 0.47 ± 0.06 | kJ/mol | Eqk | Roshchupkina, Nesterova, et al., 1987 | liquid phase; T=367.3 K |
By formula: C20H26 = C18H22
Quantity | Value | Units | Method | Reference | Comment |
---|---|---|---|---|---|
ΔrH° | -0.90 ± 0.39 | kJ/mol | Eqk | Roshchupkina, Nesterova, et al., 1987 | liquid phase; T=359 K |

Kovats' RI, non-polar column, isothermal

Column type | Active phase | Temperature (C) | I | Reference | Comment |
---|---|---|---|---|---|
Capillary | Apiezon L | 200. | 1921. | Krupcík, Leclercq, et al., 1980 | N2; Column length: 50. m; Column diameter: 0.25 mm |

References

Roshchupkina, Nesterova, et al., 1987
Roshchupkina, I.Yu.; Nesterova, T.N.; Rozhnov, A.M.,
Equilibria of isomeric transformations of alkylbiphenyls,
J. Chem. Thermodyn., 1987, 19, 299-306. [all data]
Krupcík, Leclercq, et al., 1980
Krupcík, J.; Leclercq, P.A.; Garaj, J.; Símová, A.,
Analysis of alkylated mixtures of polychlorinated biphenyls by capillary gas chromatography-mass spectrometry,
J. Chromatogr., 1980, 191, 207-220, https://doi.org/10.1016/S0021-9673(00)86381-5
. [all data]