Benzamide, N-benzoyl-
- Formula: C14H11NO2
- Molecular weight: 225.2426
- IUPAC Standard InChIKey: ZHDORMMHAKXTPT-UHFFFAOYSA-N
- CAS Registry Number: 614-28-8
- Chemical structure:

Condensed phase thermochemistry data

Data compiled by: Hussein Y. Afeefy, Joel F. Liebman, and Stephen E. Stein
Quantity | Value | Units | Method | Reference | Comment |
---|---|---|---|---|---|
ΔcH°solid | -6836.39 | kJ/mol | Ccb | Parts, 1928 |

References

Parts, 1928
Parts, A.,
Uber die Verbrennungswarme von einigen sekundaren und tertiaren Amiden,
Z. Phys. Chem., 1928, 131, 405-408. [all data]