2-methylcyclopropanecarbonitrile
- Formula: C5H7N
- Molecular weight: 81.1158
- IUPAC Standard InChIKey: MWIZMXFPLVYCEB-UHFFFAOYSA-N
- CAS Registry Number: 6142-59-2
- Chemical structure:
View 3d structure (requires JavaScript / HTML 5) - Permanent link for this species. Use this link for bookmarking this species for future reference.

Phase change data

Data compiled by: Thermodynamics Research Center, NIST Boulder Laboratories, Chris Muzny director
Quantity | Value | Units | Method | Reference | Comment |
---|---|---|---|---|---|
Tboil | 418.2 | K | N/A | Rogers, 1947 | Uncertainty assigned by TRC = 1.5 K |

References

Rogers, 1947
Rogers, M.T.,
The Electric Moments and Ultraviolet Absorption Spectra of Some Deriva- tives of Cyclopropane and Ethylene Oxide,
J. Am. Chem. Soc., 1947, 69, 2544-5. [all data]