Benzenemethanol, α-propyl-
- Formula: C10H14O
- Molecular weight: 150.2176
- IUPAC Standard InChIKey: HQRWWHIETAKIMO-UHFFFAOYSA-N
- CAS Registry Number: 614-14-2
- Chemical structure:
View 3d structure (requires JavaScript / HTML 5) - Stereoisomers:
- Other names: alpha-n-Propyl benzyl alcohol; α-Propylbenzyl alcohol; 1-Butanol, 1-phenyl; 1-Phenylbutan-1-ol; 1-Phenyl-1-butanol

Phase change data

Data compiled by: Thermodynamics Research Center, NIST Boulder Laboratories, Chris Muzny director
Quantity | Value | Units | Method | Reference | Comment |
---|---|---|---|---|---|
Tboil | 506.15 | K | N/A | Boord, Perilstein, et al., 1944 | Uncertainty assigned by TRC = 2. K |

Normal alkane RI, polar column, custom temperature program

Data compiled by: NIST Mass Spectrometry Data Center, William E. Wallace, director

Column type Capillary
Active phase Carbowax 20M
Column length (m)
Carrier gas
Substrate
Column diameter (mm)
Phase thickness (μm)
Program not specified
I 1955.
ReferenceVinogradov, 2004
Comment MSDC-RI

Van Den Dool and Kratz RI, non-polar column, temperature ramp

View large format table.

Column type Active phase I Reference Comment
CapillaryOV-11220.3Gautzsch and Zinn, 19968. K/min; Tstart: 35. C; Tend: 300. C

Normal alkane RI, non-polar column, custom temperature program

View large format table.

Column type Active phase I Reference Comment
CapillarySE-301310.Vinogradov, 2004Program: not specified

References

Boord, Perilstein, et al., 1944
Boord, C.E.; Perilstein, W.L.; Greenlee, K.W.,
, Am. Pet. Inst. Hydrocarbon Res. Proj., Sixth Annu. Ref., Ohio State Univ., Aug. 31, 1944. [all data]