α,α,α-trifluoro-p-xylene
- Formula: C8H7F3
- Molecular weight: 160.1364
- CAS Registry Number: 6140-17-6

Gas phase ion energetics data

Data compiled by: John E. Bartmess
De-protonation reactions
C8H6F3- + = C8H7F3
By formula: C8H6F3- + H+ = C8H7F3
Quantity | Value | Units | Method | Reference | Comment |
---|---|---|---|---|---|
ΔrH° | 1536. ± 8.8 | kJ/mol | G+TS | Caldwell and Bartmess | gas phase; value altered from reference due to change in acidity scale |
Quantity | Value | Units | Method | Reference | Comment |
ΔrG° | 1505. ± 8.4 | kJ/mol | IMRE | Caldwell and Bartmess | gas phase; value altered from reference due to change in acidity scale |

Reaction thermochemistry data

Data compiled by: John E. Bartmess

Individual Reactions

C8H6F3- + Hydrogen cation = C8H7F3

By formula: C8H6F3- + H+ = C8H7F3

Quantity Value Units Method Reference Comment
Δr1536. ± 8.8kJ/molG+TSCaldwell and Bartmessgas phase; value altered from reference due to change in acidity scale
Quantity Value Units Method Reference Comment
Δr1505. ± 8.4kJ/molIMRECaldwell and Bartmessgas phase; value altered from reference due to change in acidity scale

References

Caldwell and Bartmess
Caldwell, G.; Bartmess, J.E.,
, Unpublished results. [all data]