Benzoic acid, hydrazide
- Formula: C7H8N2O
- Molecular weight: 136.1512
- IUPAC Standard InChIKey: WARCRYXKINZHGQ-UHFFFAOYSA-N
- CAS Registry Number: 613-94-5
- Chemical structure:
View 3d structure (requires JavaScript / HTML 5) - Other names: Benzhydrazide; Benzohydrazide; Benzohydrazine; Benzoic hydrazide; Benzoyl hydrazide; Benzoylhydrazine; Hydrazine, benzoyl-; NSC 644; Hydrazid kyseliny benzoove; Benzenecarboxylic acid hydrazide; N-Aminobenzamide

Phase change data

Data compiled by: William E. Acree, Jr., James S. Chickos
Enthalpy of fusion
ΔfusH (kJ/mol) | Temperature (K) | Method | Reference |
---|---|---|---|
25.7 | 388.2 | DSC | Chickos and Acree, 2002 |

Normal alkane RI, non-polar column, custom temperature program

Column type | Active phase | I | Reference | Comment |
---|---|---|---|---|
Capillary | CP Sil 5 CB | 1205. | Guyot, Scheirman, et al., 1999 | He; Column length: 50. m; Column diameter: 0.32 mm; Program: 30C => 55C/min => 85C => 1C/min => 145C => 3C/min => 250C |

References

Chickos and Acree, 2002
Chickos, James S.; Acree, William E.,
Total phase change entropies and enthalpies,
Thermochimica Acta, 2002, 395, 1-2, 59-113, https://doi.org/10.1016/S0040-6031(02)00213-7
. [all data]
Grammaticakis, 1953
Grammaticakis, P.,
Contribution a l'etude de l'absorption dans l'ultra-violet moyen et le visible de quelques hydrazines α, β-disubstituees et de leurs produits d'oxydation. III. Diacidylhydrazines, diacidyldiimides et oxydiazols-1-3-4,
Bull. Soc. Chim. Fr., 1953, 20, 86-93. [all data]
Guyot, Scheirman, et al., 1999
Guyot, C.; Scheirman, V.; Collin, S.,
Floral origin markers of heather honeys: Calluna vulgaris and Erica arborea,
Food Chem., 1999, 64, 1, 3-11, https://doi.org/10.1016/S0308-8146(98)00122-8
. [all data]