Benzeneacetonitrile, α-oxo-
- Formula: C8H5NO
- Molecular weight: 131.1314
- IUPAC Standard InChIKey: GJQBHOAJJGIPRH-UHFFFAOYSA-N
- CAS Registry Number: 613-90-1
- Chemical structure:

Gas phase thermochemistry data

Data compiled by: Hussein Y. Afeefy, Joel F. Liebman, and Stephen E. Stein
Quantity | Value | Units | Method | Reference | Comment |
---|---|---|---|---|---|
ΔfH°gas | 117.5 | kJ/mol | Ccb | Lebedeva, Dneprovskii, et al., 1969 |

Condensed phase thermochemistry data

Data compiled by: Hussein Y. Afeefy, Joel F. Liebman, and Stephen E. Stein
Quantity | Value | Units | Method | Reference | Comment |
---|---|---|---|---|---|
ΔfH°solid | 38.9 ± 0.3 | kJ/mol | Ccb | Lebedeva, Dneprovskii, et al., 1969 | |
ΔfH°solid | 73.2 | kJ/mol | Ccb | Guinchant, 1918 | Author hf288_condensed[kcal/mol]=14.2 kcal/mol |
Quantity | Value | Units | Method | Reference | Comment |
ΔcH°solid | -3901.5 ± 0.3 | kJ/mol | Ccb | Lebedeva, Dneprovskii, et al., 1969 | |
ΔcH°solid | -3936. | kJ/mol | Ccb | Guinchant, 1918 | Author hf288_condensed[kcal/mol]=14.2 kcal/mol |

Phase change data

Data compiled as indicated in comments:
BS - Robert L. Brown and Stephen E. Stein
AC - William E. Acree, Jr., James S. Chickos
ALS - Hussein Y. Afeefy, Joel F. Liebman, and Stephen E. Stein
Quantity | Value | Units | Method | Reference | Comment |
---|---|---|---|---|---|
Tboil | 479.2 | K | N/A | Weast and Grasselli, 1989 | BS |
Quantity | Value | Units | Method | Reference | Comment |
ΔsubH° | 78.7 ± 4.2 | kJ/mol | N/A | Lebedeva, Dneprovskii, et al., 1969, 2 | Based on data from 292. to 304. K. See also Pedley and Rylance, 1977 and Stephenson and Malanowski, 1987.; AC |
ΔsubH° | 78.7 | kJ/mol | V | Lebedeva, Dneprovskii, et al., 1969 | ALS |
Enthalpy of vaporization
ΔvapH (kJ/mol) | Temperature (K) | Method | Reference | Comment |
---|---|---|---|---|
52.0 | 333. | A | Stephenson and Malanowski, 1987 | Based on data from 318. to 481. K. See also Stull, 1947.; AC |
Antoine Equation Parameters
log10(P) = A − (B / (T + C))
P = vapor pressure (bar)
T = temperature (K)
View plot Requires a JavaScript / HTML 5 canvas capable browser.
Temperature (K) | A | B | C | Reference | Comment |
---|---|---|---|---|---|
317.7 to 481. | 4.87952 | 2151.446 | -40.103 | Stull, 1947 | Coefficents calculated by NIST from author's data. |

Gas phase ion energetics data

Data compiled by: John E. Bartmess

Electron affinity determinations

EA (eV) Method Reference Comment
1.127 ± 0.087IMREHuh, Kang, et al., 1999ΔG(EA) 343K; anchored to ΔG value. Including anchor ΔS, EA is ca. 0.4 kcal/mol more bound.

References

Lebedeva, Dneprovskii, et al., 1969
Lebedeva, N.D.; Dneprovskii, A.S.; Katin, Yu.A.,
Heats of combustion and enthalpies of formation of benzoyl cyanide, ω-cyanoacetophenone, and β-cyanopropiophenone,
Russ. J. Phys. Chem. (Engl. Transl.), 1969, 43, 770-773. [all data]
Guinchant, 1918
Guinchant, M.J.,
Etude sur la fonction acide dans les derives metheniques et methiniques,
Ann. Chem., 1918, 10, 30-84. [all data]
Weast and Grasselli, 1989
CRC Handbook of Data on Organic Compounds, 2nd Editon, Weast,R.C and Grasselli, J.G., ed(s)., CRC Press, Inc., Boca Raton, FL, 1989, 1. [all data]
Lebedeva, Dneprovskii, et al., 1969, 2
Lebedeva, N.D.; Dneprovskii, A.S.; Katin, Y.A.,
Russ. J. Phys. Chem., 1969, 43, 6, 770. [all data]
Pedley and Rylance, 1977
Pedley, J.B.; Rylance, J.,
, Computer Analysed Thermochemical Data: Organic and Organometallic Compounds, University of Sussex, Brighton, 1977. [all data]
Stephenson and Malanowski, 1987
Stephenson, Richard M.; Malanowski, Stanislaw,
Handbook of the Thermodynamics of Organic Compounds, 1987, https://doi.org/10.1007/978-94-009-3173-2
. [all data]
Stull, 1947
Stull, Daniel R.,
Vapor Pressure of Pure Substances. Organic and Inorganic Compounds,
Ind. Eng. Chem., 1947, 39, 4, 517-540, https://doi.org/10.1021/ie50448a022
. [all data]