7-Tetradecanone
- Formula: C14H28O
- Molecular weight: 212.3715
- IUPAC Standard InChIKey: ZEKPOTWCBTUBEB-UHFFFAOYSA-N
- CAS Registry Number: 6137-34-4
- Chemical structure:
View 3d structure (requires JavaScript / HTML 5) - Species with the same structure:

Phase change data

Data compiled as indicated in comments:
TRC - Thermodynamics Research Center, NIST Boulder Laboratories, Chris Muzny director
AC - William E. Acree, Jr., James S. Chickos
Quantity | Value | Units | Method | Reference | Comment |
---|---|---|---|---|---|
Tc | 722.9 | K | N/A | Pulliam, Gude, et al., 1995 | Uncertainty assigned by TRC = 4.2 K; TRC |
Quantity | Value | Units | Method | Reference | Comment |
ρc | 1.11 | mol/l | N/A | Pulliam, Gude, et al., 1995 | Uncertainty assigned by TRC = 0.03 mol/l; TRC |
Enthalpy of vaporization
ΔvapH (kJ/mol) | Temperature (K) | Method | Reference | Comment |
---|---|---|---|---|
66.9 | 450. | A,ME | Stephenson and Malanowski, 1987 | Based on data from 438. to 462. K. See also Ubbelohde, 1938.; AC |

References

Pulliam, Gude, et al., 1995
Pulliam, M.K.; Gude, M.T.; Teja, A.S.,
Critical Temperatures and Densities of n-Alkanones,
J. Chem. Eng. Data, 1995, 40, 455-8. [all data]
Stephenson and Malanowski, 1987
Stephenson, Richard M.; Malanowski, Stanislaw,
Handbook of the Thermodynamics of Organic Compounds, 1987, https://doi.org/10.1007/978-94-009-3173-2
. [all data]
Ubbelohde, 1938
Ubbelohde, A.R.,
Structure and thermodynamic properties of long-chain compounds,
Trans. Faraday Soc., 1938, 34, 282, https://doi.org/10.1039/tf9383400282
. [all data]