2-Heptanone, 4-methyl-
- Formula: C8H16O
- Molecular weight: 128.2120
- IUPAC Standard InChIKey: BIFPSSTVLFHHEI-UHFFFAOYSA-N
- CAS Registry Number: 6137-06-0
- Chemical structure:
View 3d structure (requires JavaScript / HTML 5) - Other names: 4-Methyl-2-heptanone

Phase change data

Data compiled by: Thermodynamics Research Center, NIST Boulder Laboratories, Chris Muzny director
Quantity | Value | Units | Method | Reference | Comment |
---|---|---|---|---|---|
Tboil | 429. | K | N/A | Clarke, 1907 | Uncertainty assigned by TRC = 5. K |

Van Den Dool and Kratz RI, non-polar column, temperature ramp

View large format table.

Column type Active phase I Reference Comment
CapillaryDB-5936.4Xu, van Stee, et al., 200330. m/0.25 mm/1. μm, He, 2.5 K/min; Tstart: 50. C; Tend: 200. C

Van Den Dool and Kratz RI, polar column, temperature ramp

View large format table.

Column type Active phase I Reference Comment
CapillaryDB-Wax1206.Sumitani, Suekane, et al., 1994He, 40. C @ 5. min, 3. K/min; Column length: 60. m; Column diameter: 0.25 mm; Tend: 200. C

Normal alkane RI, non-polar column, temperature ramp

View large format table.

Column type Active phase I Reference Comment
CapillaryHP-5 MS949.Radulovic, Dordevic, et al., 201030. m/0.25 mm/0.25 μm, Helium, 5. K/min, 290. C @ 10. min; Tstart: 70. C

Normal alkane RI, non-polar column, custom temperature program

View large format table.

Column type Active phase I Reference Comment
CapillaryHP-5943.Timón, Ventanas, et al., 199850. m/0.32 mm/0.52 μm, He; Program: 35 0C 10 0C/min -> 200 0C (20 min) 5 0C/min -> 230 0C (50 min)

Normal alkane RI, polar column, custom temperature program

View large format table.

Column type Active phase I Reference Comment
CapillarySOLGel-Wax1224.Johanningsmeier and McFeeters, 201130. m/0.25 mm/0.25 μm, Helium; Program: 40 0C (2 min) 5 0C/min -> 140 0C 10 0C/min -> 250 0C (3 min)
CapillarySOLGel-Wax1206.Johanningsmeier and McFeeters, 201130. m/0.25 mm/0.25 μm, Helium; Program: not specified
CapillaryDB-Wax1213.Canuti, Conversano, et al., 200930. m/0.25 mm/0.25 μm, Helium; Program: 40 0C (4 min) 2.5 0C/min -> 80 0C 5 0C/min -> 110 0C 10 0C/min -> 220 0C (5 min)
CapillaryDB-Wax1206.Canuti, Conversano, et al., 200930. m/0.25 mm/0.25 μm, Helium; Program: not specified

References

Clarke, 1907
Clarke, L.,
Chem. Ber., 1907, 40, 354. [all data]