Benzaldehyde, 2,4-dimethoxy-
- Formula: C9H10O3
- Molecular weight: 166.1739
- IUPAC Standard InChIKey: LWRSYTXEQUUTKW-UHFFFAOYSA-N
- CAS Registry Number: 613-45-6
- Chemical structure:
View 3d structure (requires JavaScript / HTML 5) - Other names: 2,4-Dimethoxybenzaldehyde; 2-Hydroxy-4-methoxybenzaldehyde, methyl ether

Phase change data

Data compiled by: Robert L. Brown and Stephen E. Stein
Reduced pressure boiling point
Tboil (K) | Pressure (bar) | Reference |
---|---|---|
438.2 | 0.013 | Weast and Grasselli, 1989 |

Van Den Dool and Kratz RI, non-polar column, custom temperature program

Column type | Active phase | I | Reference | Comment |
---|---|---|---|---|
Capillary | VF-5MS | 1546.3 | Tret'yakov, 2008 | 30. m/0.25 mm/0.25 μm, He; Program: Multi-step temperature program; T(initial)=60C; T(final)=270C |

References

Weast and Grasselli, 1989
CRC Handbook of Data on Organic Compounds, 2nd Editon, Weast,R.C and Grasselli, J.G., ed(s)., CRC Press, Inc., Boca Raton, FL, 1989, 1. [all data]
Tret'yakov, 2008
Tret'yakov, K.V.,
Retention Data. NIST Mass Spectrometry Data Center., NIST Mass Spectrometry Data Center, 2008. [all data]