1,1'-Biphenyl, 4-methoxy-
- Formula: C13H12O
- Molecular weight: 184.2338
- IUPAC Standard InChIKey: RHDYQUZYHZWTCI-UHFFFAOYSA-N
- CAS Registry Number: 613-37-6
- Chemical structure:
View 3d structure (requires JavaScript / HTML 5) - Other names: Anisole, p-phenyl-; p-Methoxybiphenyl; 4-Methoxybiphenyl; 4-Methoxy-1,1'-biphenyl; p-Phenylanisole; 4-Methoxydiphenyl

Van Den Dool and Kratz RI, non-polar column, custom temperature program

Column type | Active phase | I | Reference | Comment |
---|---|---|---|---|
Capillary | VF-5MS | 1695.9 | Tret'yakov, 2007 | 30. m/0.25 mm/0.25 μm, He; Program: Multi-step temperature program; T(initial)=60C; T(final)=270C |

Normal alkane RI, non-polar column, temperature ramp

Column type | Active phase | I | Reference | Comment |
---|---|---|---|---|
Capillary | Ultra-1 | 1606. | Okumura, 1991 | 25. m/0.32 mm/0.25 μm, He, 3. K/min; Tstart: 80. C; Tend: 260. C |

References

Bolshakov, et al., 1969
Bolshakov, G.F., et al.,
Ultraviolet Spectra of Heteroorganic Compounds, 1969, 306. [all data]
Tret'yakov, 2007
Tret'yakov, K.V.,
Retention Data. NIST Mass Spectrometry Data Center., NIST Mass Spectrometry Data Center, 2007. [all data]
Okumura, 1991
Okumura, T.,
retention indices of environmental chemicals on methyl silicone capillary column,
Journal of Environmental Chemistry (Japan), 1991, 1, 2, 333-358, https://doi.org/10.5985/jec.1.333
. [all data]