(S)-(+)-3-methylhexane
- Formula: C7H16
- Molecular weight: 100.2019
- IUPAC Standard InChIKey: VLJXXKKOSFGPHI-SSDOTTSWSA-N
- CAS Registry Number: 6131-24-4
- Chemical structure:
View 3d structure (requires JavaScript / HTML 5) - Stereoisomers:

Phase change data

Data compiled by: Thermodynamics Research Center, NIST Boulder Laboratories, Chris Muzny director
Quantity | Value | Units | Method | Reference | Comment |
---|---|---|---|---|---|
Tboil | 364.7 ± 0.9 | K | AVG | N/A | Average of 6 values; Individual data points |

References

No reference data available.