1,1-dichloro-3,3-dimethylpentane
- Formula: C7H14Cl2
- Molecular weight: 169.092
- IUPAC Standard InChIKey: CXVWAHRKKUGQEN-UHFFFAOYSA-N
- CAS Registry Number: 6130-99-0
- Chemical structure:
View 3d structure (requires JavaScript / HTML 5) - Permanent link for this species. Use this link for bookmarking this species for future reference.

Phase change data

Data compiled by: Thermodynamics Research Center, NIST Boulder Laboratories, Chris Muzny director
Quantity | Value | Units | Method | Reference | Comment |
---|---|---|---|---|---|
Tboil | 449. | K | N/A | Schmerling, 1946 | Uncertainty assigned by TRC = 3. K |

References

Schmerling, 1946
Schmerling, L.,
Condensation of Saturated Halides with Unsaturated Compounds II. The Condensation of ALkyl Halides with Monohaloolefins,
J. Am. Chem. Soc., 1946, 68, 1650-4. [all data]