Butane, 1,1-dichloro-3,3-dimethyl-
- Formula: C6H12Cl2
- Molecular weight: 155.065
- IUPAC Standard InChIKey: BLRPQFOUUPCTED-UHFFFAOYSA-N
- CAS Registry Number: 6130-96-7
- Chemical structure:
View 3d structure (requires JavaScript / HTML 5) - Other names: 1,1-dichloro-3,3-dimethylbutane

Phase change data

Data compiled as indicated in comments:
BS - Robert L. Brown and Stephen E. Stein
TRC - Thermodynamics Research Center, NIST Boulder Laboratories, Chris Muzny director
Quantity | Value | Units | Method | Reference | Comment |
---|---|---|---|---|---|
Tboil | 420.2 | K | N/A | Aldrich Chemical Company Inc., 1990 | BS |
Tboil | 423. | K | N/A | Schmerling, 1946 | Uncertainty assigned by TRC = 2. K; TRC |
Quantity | Value | Units | Method | Reference | Comment |
Tfus | 212.85 | K | N/A | Pomerantz, Fookson, et al., 1954 | Uncertainty assigned by TRC = 0.6 K; TRC |
Tfus | 217. | K | N/A | Schmerling, 1946 | Uncertainty assigned by TRC = 4. K; TRC |

Van Den Dool and Kratz RI, non-polar column, temperature ramp

Column type | Active phase | I | Reference | Comment |
---|---|---|---|---|
Capillary | Petrocol DH | 871. | White, Hackett, et al., 1992 | 100. m/0.25 mm/0.5 μm, He, 1. K/min; Tstart: 30. C; Tend: 220. C |

References

Aldrich Chemical Company Inc., 1990
Aldrich Chemical Company Inc.,
Catalog Handbook of Fine Chemicals, Aldrich Chemical Company, Inc., Milwaukee WI, 1990, 1. [all data]
Schmerling, 1946
Schmerling, L.,
Condensation of Saturated Halides with Unsaturated Compounds II. The Condensation of ALkyl Halides with Monohaloolefins,
J. Am. Chem. Soc., 1946, 68, 1650-4. [all data]
Pomerantz, Fookson, et al., 1954
Pomerantz, P.; Fookson, A.; Mears, T.W.; Rothberg, S.; Howard, F.L.,
Synthesis and Physical Properties of Several Acetylenic Hydrocarbons,
J. Res. Natl. Bur. Stand. (U. S.), 1954, 52, 51. [all data]
White, Hackett, et al., 1992
White, C.M.; Hackett, J.; Anderson, R.R.; Kail, S.; Spock, P.S.,
Linear temperature programmed retention indices of gasoline range hydrocarbons and chlorinated hydrocarbons on cross-linked polydimethylsiloxane,
J. Hi. Res. Chromatogr., 1992, 15, 2, 105-120, https://doi.org/10.1002/jhrc.1240150211
. [all data]