N-Formylimidazole diethyl acetal
- Formula: C8H14N2O2
- Molecular weight: 170.2090
- IUPAC Standard InChIKey: SXYWTJVFBWNDCA-UHFFFAOYSA-N
- CAS Registry Number: 61278-81-7
- Chemical structure:

Phase change data

Data compiled by: Hussein Y. Afeefy, Joel F. Liebman, and Stephen E. Stein
Quantity | Value | Units | Method | Reference | Comment |
---|---|---|---|---|---|
ΔvapH° | 74.0 ± 1.2 | kJ/mol | E | Guthrie and Pike, 1987 | Heat of hydrolysis |

Reaction thermochemistry data

Data compiled by: Hussein Y. Afeefy, Joel F. Liebman, and Stephen E. Stein
Individual Reactions
By formula: C8H14N2O2 + H2O = C3H6O2 + C3H4N2 + C2H6O
Quantity | Value | Units | Method | Reference | Comment |
---|---|---|---|---|---|
ΔrH° | -34.6 ± 1.8 | kJ/mol | Cm | Guthrie and Pike, 1987 | liquid phase; Heat of hydrolysis |

Condensed phase thermochemistry data

Data compiled by: Hussein Y. Afeefy, Joel F. Liebman, and Stephen E. Stein

Quantity Value Units Method Reference Comment
Δfliquid-329.3 ± 2.8kJ/molCmGuthrie and Pike, 1987Heat of hydrolysis

Gas phase thermochemistry data

Data compiled by: Hussein Y. Afeefy, Joel F. Liebman, and Stephen E. Stein

Quantity Value Units Method Reference Comment
Δfgas-255.3 ± 3.0kJ/molCmGuthrie and Pike, 1987Heat of hydrolysis

References

Guthrie and Pike, 1987
Guthrie, J.P.; Pike, D.C.,
Hydration of acylimidazoles: tetrahedral intermediates in acylimidazole hydrolysis and nucleophilic attack by imidazole on esters. The question of concerted mechanisms for acyl transfers,
Can. J. Chem., 1987, 65, 1951-1969. [all data]