1,1':3',1''-Terphenyl, 5'-phenyl-
- Formula: C24H18
- Molecular weight: 306.3997
- IUPAC Standard InChIKey: SXWIAEOZZQADEY-UHFFFAOYSA-N
- CAS Registry Number: 612-71-5
- Chemical structure:
View 3d structure (requires JavaScript / HTML 5) - Other names: m-Terphenyl, 5'-phenyl-; Benzene, 1,3,5-triphenyl-; 1,1'-Biphenyl, 3,5-diphenyl-; 1,3,5-Triphenylbenzene; s-Triphenylbenzene; Triphenylbenzene; 5'-Phenyl-m-terphenyl; Symmetrical triphenylbenzene; 5'-Phenyl-1,1':3',1''-terphenyl; NSC 17358

Normal alkane RI, non-polar column, temperature ramp

Column type | Active phase | I | Reference | Comment |
---|---|---|---|---|
Capillary | Ultra-1 | 2891. | Elizalde-González, Hutfliess, et al., 1996 | 50. m/0.2 mm/0.33 μm, H2, 3. K/min, 300. C @ 35. min; Tstart: 60. C |

Lee's RI, non-polar column, custom temperature program

Column type | Active phase | I | Reference | Comment |
---|---|---|---|---|
Capillary | SE-52 | 469.48 | Shlyakhov, 1984 | Program: not specified |

Gas phase thermochemistry data

Data compiled by: Donald R. Burgess, Jr.
Quantity | Value | Units | Method | Reference | Comment |
---|---|---|---|---|---|
ΔfH°gas | 371.8 ± 3.8 | kJ/mol | Review | Roux, Temprado, et al., 2008 | There are sufficient literature values to make a qualified recommendation where the suggested value is in good agreement with values predicted using thermochemical cycles or from reliable estimates. In general, the evaluated uncertainty limits are on the order of (2 to 4) kJ/mol. |

Condensed phase thermochemistry data

Data compiled as indicated in comments:
DRB - Donald R. Burgess, Jr.
ALS - Hussein Y. Afeefy, Joel F. Liebman, and Stephen E. Stein
DH - Eugene S. Domalski and Elizabeth D. Hearing

Quantity Value Units Method Reference Comment
Δfsolid222. ± 3.4kJ/molReviewRoux, Temprado, et al., 2008There are sufficient literature values to make a qualified recommendation where the suggested value is in good agreement with values predicted using thermochemical cycles or from reliable estimates. In general, the evaluated uncertainty limits are on the order of (2 to 4) kJ/mol.; DRB
Δfsolid224.6 ± 5.4kJ/molCcbRichardson and Parks, 1939Reanalyzed by Cox and Pilcher, 1970, Original value = 221.4 kJ/mol; see Richardson, 1939; ALS
Quantity Value Units Method Reference Comment
Δcsolid-12241.3 ± 5.3kJ/molCcbRichardson and Parks, 1939Reanalyzed by Cox and Pilcher, 1970, Original value = -12236.1 kJ/mol; see Richardson, 1939; Corresponding Δfsolid = 224.6 kJ/mol (simple calculation by NIST; no Washburn corrections); ALS
Quantity Value Units Method Reference Comment
solid,1 bar375.5J/mol*KN/ALebedev, Bykova, et al., 1982DH
solid,1 bar367.4J/mol*KN/AParks, Todd, et al., 1936Extrapolation below 90 K, 114.64 J/mol*K.; DH

Constant pressure heat capacity of solid

Cp,solid (J/mol*K) Temperature (K) Reference Comment
361.0298.15Lebedev, Bykova, et al., 1982T = 13.8 to 480 K.; DH
358.32298.1Parks, Todd, et al., 1936T = 90 to 300 K.; DH

Phase change data

Data compiled as indicated in comments:
BS - Robert L. Brown and Stephen E. Stein
TRC - Thermodynamics Research Center, NIST Boulder Laboratories, Chris Muzny director
AC - William E. Acree, Jr., James S. Chickos
DRB - Donald R. Burgess, Jr.
ALS - Hussein Y. Afeefy, Joel F. Liebman, and Stephen E. Stein
DH - Eugene S. Domalski and Elizabeth D. Hearing

Quantity Value Units Method Reference Comment
Tboil733.2KN/AAldrich Chemical Company Inc., 1990BS
Quantity Value Units Method Reference Comment
Tfus450.1KN/ASangster and Irvine, 1956Uncertainty assigned by TRC = 4. K; TRC
Tfus448.KN/ABaxter and Hale, 1936Uncertainty assigned by TRC = 0.3 K; TRC
Tfus444.KN/AParks, Todd, et al., 1936, 2Uncertainty assigned by TRC = 1.5 K; TRC
Tfus446.KN/AAdkins, Zartman, et al., 1931Uncertainty assigned by TRC = 3. K; TRC
Quantity Value Units Method Reference Comment
Ttriple446.KN/ALebedev, Bykova, et al., 1982, 2Uncertainty assigned by TRC = 1. K; TRC
Quantity Value Units Method Reference Comment
Δvap133.4 ± 2.0kJ/molGCGHanshaw, Nutt, et al., 2008AC
Δvap140.kJ/molCGCChickos, Hesse, et al., 1998AC
Quantity Value Units Method Reference Comment
Δsub149. ± 6.kJ/molAVGN/AAverage of 7 values; Individual data points

Enthalpy of vaporization

ΔvapH (kJ/mol) Temperature (K) Method Reference Comment
77.5515.AStephenson and Malanowski, 1987Based on data from 500. - 735. K. See also Vohra, Kang, et al., 1962.; AC
118.469.AStephenson and Malanowski, 1987Based on data from 454. - 500. K. See also Malaspina, Bardi, et al., 1974.; AC

Antoine Equation Parameters

log10(P) = A − (B / (T + C))
    P = vapor pressure (bar)
    T = temperature (K)

View plot Requires a JavaScript / HTML 5 canvas capable browser.

Temperature (K) A B C Reference Comment
453.99 - 499.990.80427684.343-316.422Malaspina, Bardi, et al., 1974Coefficents calculated by NIST from author's data.

Enthalpy of sublimation

ΔsubH (kJ/mol) Temperature (K) Method Reference Comment
141.2 ± 0.7418.MERibeiro da Silva, Monte, et al., 2006Based on data from 407. - 429. K.; AC
145.6 ± 0.9376.TVerevkin, 1997Based on data from 364. - 388. K.; AC
142.425.MEMalaspina, Bardi, et al., 1974Based on data from 410. - 444. K. See also Stephenson and Malanowski, 1987.; AC
142.2422.MEWakayama and Inokuchi, 1967Based on data from 384. - 400. K.; AC
164.4 ± 4.2363.VHoyer and Peperle, 1958Reanalyzed by Pedley, Naylor, et al., 1986, Original value = 141. kJ/mol; ALS

Enthalpy of fusion

ΔfusH (kJ/mol) Temperature (K) Method Reference Comment
33.400446.N/ALebedev, Bykova, et al., 1982DH
32.6445.2DSCVerevkin, 1997AC
33.4446.N/ALebedev, Bykova, et al., 1982, 2AC

Entropy of fusion

ΔfusS (J/mol*K) Temperature (K) Reference Comment
75.1446.Lebedev, Bykova, et al., 1982DH

In addition to the Thermodynamics Research Center (TRC) data available from this site, much more physical and chemical property data is available from the following TRC products:

References

Rodebush and Feldman, 1946
Rodebush, W.H.; Feldman, I.,
Ultraviolet absorption spectra of organic molecules. III. Mechanical interference of substituent groups with resonance configurations,
J. Am. Chem. Soc., 1946, 68, 896-899. [all data]
Elizalde-González, Hutfliess, et al., 1996
Elizalde-González, M.P.; Hutfliess, M.; Hedden, K.,
Retention index system, adsorption characteristics, and sructure correlations of polycyclic aromatic hydrocarbons in fuels,
J. Hi. Res. Chromatogr., 1996, 19, 6, 345-352, https://doi.org/10.1002/jhrc.1240190608
. [all data]
Shlyakhov, 1984
Shlyakhov, A.F.,
Gas chromatography in organic geochemistry, Nedra, Moscow, 1984, 221. [all data]