Benzenamine, N-ethyl-N-nitroso-
- Formula: C8H10N2O
- Molecular weight: 150.1778
- IUPAC Standard InChIKey: WXRXVZXYLBWKRG-UHFFFAOYSA-N
- CAS Registry Number: 612-64-6
- Chemical structure:

Condensed phase thermochemistry data

Data compiled by: Hussein Y. Afeefy, Joel F. Liebman, and Stephen E. Stein
Quantity | Value | Units | Method | Reference | Comment |
---|---|---|---|---|---|
ΔcH°solid | -4679.8 | kJ/mol | Ccb | Swientoslawski, 1910 |

Reaction thermochemistry data

Data compiled by: Hussein Y. Afeefy, Joel F. Liebman, and Stephen E. Stein
Individual Reactions
By formula: C8H11N + HNO2 = C8H10N2O + H2O
Quantity | Value | Units | Method | Reference | Comment |
---|---|---|---|---|---|
ΔrH° | -78.83 | kJ/mol | Cm | Swientoslawski, 1910 | liquid phase |

References

Swientoslawski, 1910
Swientoslawski, W.,
Thermochemische Untersuchungen der organischen Verbindungen. Dritte Mitteilung. Stickstoffhaltige Verbindungen.,
Z. Phys. Chem., 1910, 72, 49-83. [all data]