Quinoline, 7-methyl-

Van Den Dool and Kratz RI, non-polar column, temperature ramp

Data compiled by: NIST Mass Spectrometry Data Center, William E. Wallace, director

Column type Capillary
Active phase DB-5
Column length (m) 30.
Carrier gas He
Substrate
Column diameter (mm) 0.26
Phase thickness (μm) 0.25
Tstart (C) 50.
Tend (C) 300.
Heat rate (K/min) 6.
Initial hold (min) 4.
Final hold (min) 20.
I 1355.
ReferenceRostad and Pereira, 1986
Comment MSDC-RI

Kovats' RI, non-polar column, isothermal

View large format table.

Column type Active phase Temperature (C) I Reference Comment
CapillaryOV-101140.1338.Dmitrikov and Nabivach, 1995He
CapillaryOV-101160.1354.Dmitrikov and Nabivach, 1995He
CapillaryOV-101140.1338.Berlizov, Nabivach, et al., 1987N2; Column length: 50. m; Column diameter: 0.22 mm
CapillaryOV-101160.1354.Berlizov, Nabivach, et al., 1987N2; Column length: 50. m; Column diameter: 0.22 mm
CapillaryOV-101150.1334.Morishita, Morimoto, et al., 1986N2; Column length: 20. m; Column diameter: 0.23 mm

Kovats' RI, polar column, isothermal

View large format table.

Column type Active phase Temperature (C) I Reference Comment
CapillaryPEG-20M140.1995.Dmitrikov and Nabivach, 1995He
CapillaryPEG-20M160.2020.Dmitrikov and Nabivach, 1995He
CapillaryPEG-20M140.1995.Berlizov, Nabivach, et al., 1987N2; Column length: 30. m; Column diameter: 0.25 mm
CapillaryPEG-20M160.2020.Berlizov, Nabivach, et al., 1987N2; Column length: 30. m; Column diameter: 0.25 mm
CapillaryPEG-20M140.1995.Buryan, Macák, et al., 1987N2; Column length: 30. m; Column diameter: 0.25 mm
CapillaryPEG-20M160.2020.Buryan, Macák, et al., 1987N2; Column length: 30. m; Column diameter: 0.25 mm
CapillaryPEG-20M150.2016.Morishita, Morimoto, et al., 1986N2; Column length: 20. m; Column diameter: 0.23 mm

Normal alkane RI, polar column, custom temperature program

View large format table.

Column type Active phase I Reference Comment
CapillaryDB-Wax2053.Peng, Yang, et al., 1991Program: not specified

Lee's RI, non-polar column, temperature ramp

View large format table.

Column type Active phase I Reference Comment
CapillaryOV-101230.99Blanco, Blanco, et al., 1989H2, 4. K/min; Column length: 25. m; Column diameter: 0.22 mm; Tstart: 50. C; Tend: 300. C
CapillaryDB-5231.46Rostad and Pereira, 198630. m/0.26 mm/0.25 μm, He, 50. C @ 4. min, 6. K/min, 300. C @ 20. min
CapillarySE-52231.37Vassilaros, Kong, et al., 198220. m/0.30 mm/0.25 μm, H2, 40. C @ 2. min, 4. K/min; Tend: 265. C

References

Rostad and Pereira, 1986
Rostad, C.E.; Pereira, W.E., Kovats and Lee retention indices determined by gas chromatography/mass spectrometry for organic compounds of environmental interest, J. Hi. Res. Chromatogr. Chromatogr. Comm., 1986, 9, 6, 328-334, https://doi.org/10.1002/jhrc.1240090603 . [all data]