Quinoline, 3-methyl-
- Formula: C10H9N
- Molecular weight: 143.1852
- IUPAC Standard InChIKey: DTBDAFLSBDGPEA-UHFFFAOYSA-N
- CAS Registry Number: 612-58-8
- Chemical structure:
View 3d structure (requires JavaScript / HTML 5) - Other names: 3-Methylquinoline

Phase change data

Data compiled as indicated in comments:
TRC - Thermodynamics Research Center, NIST Boulder Laboratories, Chris Muzny director
AC - William E. Acree, Jr., James S. Chickos
Quantity | Value | Units | Method | Reference | Comment |
---|---|---|---|---|---|
Tboil | 521.65 | K | N/A | Bruhl, 1897 | Uncertainty assigned by TRC = 3. K; TRC |
Enthalpy of vaporization
ΔvapH (kJ/mol) | Temperature (K) | Method | Reference | Comment |
---|---|---|---|---|
55.8 | 458. | A | Stephenson and Malanowski, 1987 | Based on data from 443. to 528. K. See also Malanowski, 1961.; AC |

Kovats' RI, non-polar column, isothermal

Column type | Active phase | Temperature (C) | I | Reference | Comment |
---|---|---|---|---|---|
Capillary | OV-101 | 140. | 1346. | Dmitrikov and Nabivach, 1995 | He |
Capillary | OV-101 | 160. | 1361. | Dmitrikov and Nabivach, 1995 | He |
Capillary | OV-101 | 140. | 1346. | Berlizov, Nabivach, et al., 1987 | N2; Column length: 50. m; Column diameter: 0.22 mm |
Capillary | OV-101 | 160. | 1361. | Berlizov, Nabivach, et al., 1987 | N2; Column length: 50. m; Column diameter: 0.22 mm |
Capillary | OV-101 | 150. | 1340. | Morishita, Morimoto, et al., 1986 | N2; Column length: 20. m; Column diameter: 0.23 mm |

Kovats' RI, polar column, isothermal

Column type | Active phase | Temperature (C) | I | Reference | Comment |
---|---|---|---|---|---|
Capillary | PEG-20M | 140. | 2014. | Dmitrikov and Nabivach, 1995 | He |
Capillary | PEG-20M | 160. | 2042. | Dmitrikov and Nabivach, 1995 | He |
Capillary | PEG-20M | 140. | 2014. | Berlizov, Nabivach, et al., 1987 | N2; Column length: 30. m; Column diameter: 0.25 mm |
Capillary | PEG-20M | 160. | 2042. | Berlizov, Nabivach, et al., 1987 | N2; Column length: 30. m; Column diameter: 0.25 mm |
Capillary | PEG-20M | 140. | 2014. | Buryan, Macák, et al., 1987 | N2; Column length: 30. m; Column diameter: 0.25 mm |
Capillary | PEG-20M | 160. | 2042. | Buryan, Macák, et al., 1987 | N2; Column length: 30. m; Column diameter: 0.25 mm |

Van Den Dool and Kratz RI, non-polar column, temperature ramp

Column type | Active phase | I | Reference | Comment |
---|---|---|---|---|
Capillary | DB-5 | 1361. | Rostad and Pereira, 1986 | 30. m/0.26 mm/0.25 μm, He, 50. C @ 4. min, 6. K/min, 300. C @ 20. min |

Lee's RI, non-polar column, temperature ramp

Column type | Active phase | I | Reference | Comment |
---|---|---|---|---|
Capillary | DB-5 | 232.62 | Rostad and Pereira, 1986 | 30. m/0.26 mm/0.25 μm, He, 50. C @ 4. min, 6. K/min, 300. C @ 20. min |
Capillary | SE-52 | 232.47 | Vassilaros, Kong, et al., 1982 | 20. m/0.30 mm/0.25 μm, H2, 40. C @ 2. min, 4. K/min; Tend: 265. C |

References

Bruhl, 1897
Bruhl, J.W.,
Spectrochemistry of nitrogen containing compounds V,
Z. Phys. Chem., Stoechiom. Verwandtschaftsl., 1897, 22, 373. [all data]
Stephenson and Malanowski, 1987
Stephenson, Richard M.; Malanowski, Stanislaw,
Handbook of the Thermodynamics of Organic Compounds, 1987, https://doi.org/10.1007/978-94-009-3173-2
. [all data]
Malanowski, 1961
Malanowski, S.,
Bull. Acad. Pol. Sci. Ser. Sci. Chim., 1961, 9, 83. [all data]
Dmitrikov and Nabivach, 1995
Dmitrikov, V.P.; Nabivach, V.M.,
Physico-chemical regularities of quinoline bases retention in gas chromatography,
Coke Chem. (Engl. Transl.), 1995, 8, 27-34. [all data]
Berlizov, Nabivach, et al., 1987
Berlizov, Yu.S.; Nabivach, V.M.; Mitrikov, V.P.,
Capillary gas chromatography of alkylquinolines,
Zh. Anal. Khim., 1987, 62, 6, 1119-1124. [all data]
Morishita, Morimoto, et al., 1986
Morishita, F.; Morimoto, S.; Kojima, T.,
Prediction of molecular structures of aza-arenes by retention indices and fluorescence spectra,
J. Hi. Res. Chromatogr. Chromatogr. Comm., 1986, 9, 11, 688-692, https://doi.org/10.1002/jhrc.1240091120
. [all data]
Buryan, Macák, et al., 1987
Buryan, P.; Macák, J.; Triska, J.; Vodicka, L.; Berlizov, Yu.S.; Dmitrikov, V.P.; Nabivach, V.M.,
Kováts retention indices of alkylquinolines on capillary columns,
J. Chromatogr., 1987, 391, 89-96, https://doi.org/10.1016/S0021-9673(01)94307-9
. [all data]
Rostad and Pereira, 1986
Rostad, C.E.; Pereira, W.E.,
Kovats and Lee retention indices determined by gas chromatography/mass spectrometry for organic compounds of environmental interest,
J. Hi. Res. Chromatogr. Chromatogr. Comm., 1986, 9, 6, 328-334, https://doi.org/10.1002/jhrc.1240090603
. [all data]
Vassilaros, Kong, et al., 1982
Vassilaros, D.L.; Kong, R.C.; Later, D.W.; Lee, M.L.,
Linear retention index system for polycyclic aromatic compounds. Critical evaluation and additional indices,
J. Chromatogr., 1982, 252, 1-20, https://doi.org/10.1016/S0021-9673(01)88394-1
. [all data]