1,3-Dinitropropane

Condensed phase thermochemistry data

Data compiled by: Hussein Y. Afeefy, Joel F. Liebman, and Stephen E. Stein

Quantity Value Units Method Reference Comment
Δfliquid-49.5 ± 0.2kcal/molCcbLebedeva and Ryadnenko, 1968See Lebedeva, Rjadnenko, et al., 1969
Δfliquid-53.51 ± 0.33kcal/molCcbHolcomb and Dorsey, 1949
Quantity Value Units Method Reference Comment
Δcliquid-437.6 ± 0.2kcal/molCcbLebedeva and Ryadnenko, 1968See Lebedeva, Rjadnenko, et al., 1969
Δcliquid-433.59 ± 0.33kcal/molCcbHolcomb and Dorsey, 1949

References

Lebedeva and Ryadnenko, 1968
Lebedeva, N.D.; Ryadnenko, V.L., Heats of combustion and formation of polynitroalkanes, Russ. J. Phys. Chem. (Engl. Transl.), 1968, 42, 1225-1227. [all data]

Lebedeva, Rjadnenko, et al., 1969
Lebedeva, N.D.; Rjadnenko, B.L.; Gutner, N.M., Heats of formation of some N-containing organic compounds, Int. Conf. Calorim. Therm. (Warsaw, Poland), 1969, 1-8. [all data]

Holcomb and Dorsey, 1949
Holcomb, D.E.; Dorsey, C.L., Jr., Thermodynamic properties of nitroparaffins, Ind. Eng. Chem., 1949, 41, 2788-2792. [all data]