1,4-Dihydronaphthalene
- Formula: C10H10
- Molecular weight: 130.1864
- IUPAC Standard InChIKey: FUPIVZHYVSCYLX-UHFFFAOYSA-N
- CAS Registry Number: 612-17-9
- Chemical structure:
View 3d structure (requires JavaScript / HTML 5) - Other names: Naphthalene, 1,4-dihydro-

Gas phase thermochemistry data

Data compiled by: Glushko Thermocenter, Russian Academy of Sciences, Moscow
Constant pressure heat capacity of gas
Cp,gas (J/mol*K) | Temperature (K) | Reference | Comment |
---|---|---|---|
41.33 | 50. | Dorofeeva O.V., 1988 | Recommended values were calculated statistically mechanically using force field approximation for polycyclic aromatic hydrocarbons to estimate the needed vibrational frequencies (see also [ Dorofeeva O.V., 1986]). These functions are reproduced in the reference book [ Frenkel M., 1994]. |
54.69 | 100. | ||
73.00 | 150. | ||
94.94 | 200. | ||
131.34 | 273.15 | ||
144.3 ± 2.0 | 298.15 | ||
145.25 | 300. | ||
195.27 | 400. | ||
238.33 | 500. | ||
273.55 | 600. | ||
302.24 | 700. | ||
325.89 | 800. | ||
345.60 | 900. | ||
362.17 | 1000. | ||
376.21 | 1100. | ||
388.16 | 1200. | ||
398.37 | 1300. | ||
407.15 | 1400. | ||
414.72 | 1500. |

Phase change data

Data compiled as indicated in comments:
TRC - Thermodynamics Research Center, NIST Boulder Laboratories, Chris Muzny director
AC - William E. Acree, Jr., James S. Chickos
Quantity | Value | Units | Method | Reference | Comment |
---|---|---|---|---|---|
Tboil | 481.9 | K | N/A | Schlenk and Bergmann, 1928 | Uncertainty assigned by TRC = 2. K; TRC |
Tboil | 485. | K | N/A | Zelinskii and Pavlov, 1924 | Uncertainty assigned by TRC = 4. K; TRC |
Tboil | 485. | K | N/A | Pellini, 1901 | Uncertainty assigned by TRC = 4. K; TRC |
Quantity | Value | Units | Method | Reference | Comment |
Tfus | 298. ± 7. | K | AVG | N/A | Average of 8 values; Individual data points |
Quantity | Value | Units | Method | Reference | Comment |
ΔvapH° | 54.2 ± 0.4 | kJ/mol | GS | Verevkin, 1999 | Based on data from 300. to 333. K.; AC |
Quantity | Value | Units | Method | Reference | Comment |
ΔsubH° | 63.6 ± 1.6 | kJ/mol | N/A | Verevkin, 1999 | AC |
Enthalpy of vaporization
ΔvapH (kJ/mol) | Temperature (K) | Method | Reference | Comment |
---|---|---|---|---|
53.2 ± 0.4 | 296. | GS | Verevkin, 1999 | Based on data from 300. to 333. K.; AC |
Enthalpy of fusion
ΔfusH (kJ/mol) | Temperature (K) | Method | Reference | Comment |
---|---|---|---|---|
9.35 | 298.1 | DSC | Verevkin, 1999 | AC |

Reaction thermochemistry data

Data compiled by: Hussein Y. Afeefy, Joel F. Liebman, and Stephen E. Stein
Individual Reactions
By formula: H2 + C10H10 = C10H12
Quantity | Value | Units | Method | Reference | Comment |
---|---|---|---|---|---|
ΔrH° | -113.5 ± 0.4 | kJ/mol | Chyd | Williams, 1942 | liquid phase; solvent: Acetic acid; At 302 K |

Kovats' RI, non-polar column, isothermal

Column type | Active phase | Temperature (C) | I | Reference | Comment |
---|---|---|---|---|---|
Capillary | Squalane | 120. | 1167. | Schomburg, 1966 |

Lee's RI, non-polar column, temperature ramp

Column type | Active phase | I | Reference | Comment |
---|---|---|---|---|
Capillary | HP-5 | 196.19 | Piao, Chu, et al., 1999 | 30. m/0.25 mm/0.25 μm, 50. C @ 2. min, 4. K/min, 280. C @ 20. min |
Capillary | SE-52 | 197.01 | Lee, Vassilaros, et al., 1979 | 12. m/0.3 mm/0.34 μm, He, 2. K/min; Tstart: 50. C; Tend: 250. C |

Lee's RI, non-polar column, custom temperature program

Column type | Active phase | I | Reference | Comment |
---|---|---|---|---|
Capillary | DB-5 | 193.8 | Fuentes, Font, et al., 2007 | Column length: 60. m; Program: not specified |
Capillary | DB-5MS | 195.5 | Aracil, Font, et al., 2005 | Column length: 60. m; Column diameter: 0.25 mm; Program: not specified |

References

Dorofeeva O.V., 1988
Dorofeeva O.V.,
Thermodynamic Properties of Polycyclic Aromatic Hydrocarbons in the Gaseous Phase. Institute for High Temperatures, USSR Academy of Sciences, Preprint No.1-238 (in Russian), Moscow, 1988. [all data]
Dorofeeva O.V., 1986
Dorofeeva O.V.,
On calculation of thermodynamic properties of polycyclic aromatic hydrocarbons,
Thermochim. Acta, 1986, 102, 59-66. [all data]
Frenkel M., 1994
Frenkel M.,
Thermodynamics of Organic Compounds in the Gas State, Vol. I, II, Thermodynamics Research Center, College Station, Texas, 1994, 1994. [all data]
Schlenk and Bergmann, 1928
Schlenk, W.; Bergmann, E.D.,
Justus Liebigs Ann. Chem., 1928, 463, 91. [all data]
Zelinskii and Pavlov, 1924
Zelinskii, N.D.; Pavlov, G.,
Chem. Ber., 1924, 57, 1066. [all data]
Pellini, 1901
Pellini, G.,
Gazz. Chim. Ital., 1901, 31, 1. [all data]
Verevkin, 1999
Verevkin, Sergey P.,
Thermochemical investigation on α-methyl-styrene and parent phenyl substituted alkenes,
Thermochimica Acta, 1999, 326, 1-2, 17-25, https://doi.org/10.1016/S0040-6031(98)00585-1
. [all data]
Williams, 1942
Williams, R.B.,
Heats of catalytic hydrogenation in solution. I. Apparatus, technique, and the heats of hydrogenation of certain pairs of stereoisomers,
J. Am. Chem. Soc., 1942, 64, 1395-1404. [all data]