4,4'-Diaminobenzophenone
- Formula: C13H12N2O
- Molecular weight: 212.2472
- IUPAC Standard InChIKey: ZLSMCQSGRWNEGX-UHFFFAOYSA-N
- CAS Registry Number: 611-98-3
- Chemical structure:
View 3d structure (requires JavaScript / HTML 5) - Other names: Methanone, bis(4-aminophenyl)-; Bis(4-aminophenyl)methanone

Reaction thermochemistry data

Data compiled by: Hussein Y. Afeefy, Joel F. Liebman, and Stephen E. Stein
Individual Reactions
+
= C21H16N2O4
By formula: C13H12N2O + C8H4O3 = C21H16N2O4
Quantity | Value | Units | Method | Reference | Comment |
---|---|---|---|---|---|
ΔrH° | -14.8 ± 0.1 | kcal/mol | Eqk | Karyakin, Rabinovich, et al., 1978 | liquid phase; solvent: DMF |

References

Karyakin, Rabinovich, et al., 1978
Karyakin, N.V.; Rabinovich, I.B.; Pal'tseva, N.G.,
Thermodynamics of the reactions of aromatic diamines with dianhydrides of tetracarboxylic acids,
Polym. Sci. USSR, 1978, 20, 2274-2279. [all data]