2-Butene-1,4-diol, (Z)-
- Formula: C4H8O2
- Molecular weight: 88.1051
- IUPAC Standard InChIKey: ORTVZLZNOYNASJ-UPHRSURJSA-N
- CAS Registry Number: 6117-80-2
- Chemical structure:
- Other names: (Z)-2-Butene-1,4-diol; cis-Butenediol; cis-1,4-Dihydroxy-2-butene; cis-2-Butene-1,4-Diol

Phase change data

Data compiled as indicated in comments:
BS - Robert L. Brown and Stephen E. Stein
TRC - Thermodynamics Research Center, NIST Boulder Laboratories, Chris Muzny director
AC - William E. Acree, Jr., James S. Chickos
Quantity | Value | Units | Method | Reference | Comment |
---|---|---|---|---|---|
Tboil | 508.2 | K | N/A | Weast and Grasselli, 1989 | BS |
Quantity | Value | Units | Method | Reference | Comment |
Tfus | 284.2 | K | N/A | Smith, Eberly, et al., 1956 | Uncertainty assigned by TRC = 0.5 K; TRC |
Reduced pressure boiling point
Tboil (K) | Pressure (bar) | Reference | Comment |
---|---|---|---|
405.2 | 0.021 | Weast and Grasselli, 1989 | BS |
Enthalpy of vaporization
ΔvapH (kJ/mol) | Temperature (K) | Method | Reference | Comment |
---|---|---|---|---|
74.7 | 388. | A | Stephenson and Malanowski, 1987 | Based on data from 373. to 508. K.; AC |

Reaction thermochemistry data

Data compiled by: John E. Bartmess
Individual Reactions
By formula: (Cl- • C4H8O2) + C4H8O2 = (Cl- • 2C4H8O2)
Quantity | Value | Units | Method | Reference | Comment |
---|---|---|---|---|---|
ΔrH° | 95.8 ± 1.7 | kJ/mol | TDAs | Zhang, Beglinger, et al., 1995 | gas phase |
Quantity | Value | Units | Method | Reference | Comment |
ΔrG° | 49.0 ± 4.2 | kJ/mol | TDAs | Zhang, Beglinger, et al., 1995 | gas phase |
By formula: Cl- + C4H8O2 = (Cl- • C4H8O2)
Quantity | Value | Units | Method | Reference | Comment |
---|---|---|---|---|---|
ΔrH° | 138. ± 6.3 | kJ/mol | TDAs | Zhang, Beglinger, et al., 1995 | gas phase |
Quantity | Value | Units | Method | Reference | Comment |
ΔrG° | 82.4 ± 4.2 | kJ/mol | TDAs | Zhang, Beglinger, et al., 1995 | gas phase |

Ion clustering data

Data compiled by: John E. Bartmess
Clustering reactions
By formula: Cl- + C4H8O2 = (Cl- • C4H8O2)
Quantity | Value | Units | Method | Reference | Comment |
---|---|---|---|---|---|
ΔrH° | 138. ± 6.3 | kJ/mol | TDAs | Zhang, Beglinger, et al., 1995 | gas phase |
Quantity | Value | Units | Method | Reference | Comment |
ΔrG° | 82.4 ± 4.2 | kJ/mol | TDAs | Zhang, Beglinger, et al., 1995 | gas phase |
By formula: (Cl- • C4H8O2) + C4H8O2 = (Cl- • 2C4H8O2)
Quantity | Value | Units | Method | Reference | Comment |
---|---|---|---|---|---|
ΔrH° | 95.8 ± 1.7 | kJ/mol | TDAs | Zhang, Beglinger, et al., 1995 | gas phase |
Quantity | Value | Units | Method | Reference | Comment |
ΔrG° | 49.0 ± 4.2 | kJ/mol | TDAs | Zhang, Beglinger, et al., 1995 | gas phase |

References

Weast and Grasselli, 1989
CRC Handbook of Data on Organic Compounds, 2nd Editon, Weast,R.C and Grasselli, J.G., ed(s)., CRC Press, Inc., Boca Raton, FL, 1989, 1. [all data]
Smith, Eberly, et al., 1956
Smith, W.M.; Eberly, K.C.; Hanson, E.E.; Binder, J.L.,
J. Am. Chem. Soc., 1956, 78, 626-630. [all data]
Stephenson and Malanowski, 1987
Stephenson, Richard M.; Malanowski, Stanislaw,
Handbook of the Thermodynamics of Organic Compounds, 1987, https://doi.org/10.1007/978-94-009-3173-2
. [all data]
Zhang, Beglinger, et al., 1995
Zhang, W.; Beglinger, C.; Stone, J.A.,
High-pressure mass spectrometric study of the gas-phase association of Cl- with alpha,omega-diols,
J. Phys. Chem., 1995, 99, 30, 11673, https://doi.org/10.1021/j100030a009
. [all data]