1,1'-Biphenyl, 2,4'-dimethyl-
- Formula: C14H14
- Molecular weight: 182.2610
- IUPAC Standard InChIKey: SHMKKPZGLDISGT-UHFFFAOYSA-N
- CAS Registry Number: 611-61-0
- Chemical structure:
View 3d structure (requires JavaScript / HTML 5) - Other names: o,p'-Bitolyl; 2,4'-Dimethyl-1,1'-biphenyl; 2,4'-Dimethylbiphenyl; 2,4'-Ditolyl

Phase change data

Data compiled as indicated in comments:
BS - Robert L. Brown and Stephen E. Stein
TRC - Thermodynamics Research Center, NIST Boulder Laboratories, Chris Muzny director
Quantity | Value | Units | Method | Reference | Comment |
---|---|---|---|---|---|
Tboil | 547.7 | K | N/A | Weast and Grasselli, 1989 | BS |
Tboil | 554. | K | N/A | Blades, Blades, et al., 1954 | Uncertainty assigned by TRC = 18. K; TRC |
Tboil | 549. | K | N/A | Carnelley, 1880 | Uncertainty assigned by TRC = 6. K; TRC |
Tboil | 559. | K | N/A | Carnelley, 1877 | Uncertainty assigned by TRC = 5. K; TRC |
Reduced pressure boiling point
Tboil (K) | Pressure (bar) | Reference | Comment |
---|---|---|---|
410.2 | 0.017 | Weast and Grasselli, 1989 | BS |

Kovats' RI, non-polar column, isothermal

Column type | Active phase | Temperature (C) | I | Reference | Comment |
---|---|---|---|---|---|
Packed | Apiezon L | 170. | 1526. | Kríz, Popl, et al., 1974 | |
Packed | Apiezon L | 185. | 1536. | Kríz, Popl, et al., 1974 |

Kovats' RI, polar column, isothermal

Column type | Active phase | Temperature (C) | I | Reference | Comment |
---|---|---|---|---|---|
Capillary | SP-1000 | 185. | 2100. | Kríz, Popl, et al., 1974 | N2; Column length: 50. m; Column diameter: 0.25 mm |
Capillary | SP-1000 | 200. | 2061. | Kríz, Popl, et al., 1974 | N2; Column length: 50. m; Column diameter: 0.25 mm |

Lee's RI, non-polar column, temperature ramp

Column type | Active phase | I | Reference | Comment |
---|---|---|---|---|
Capillary | HP-5 | 262.20 | Piao, Chu, et al., 1999 | 30. m/0.25 mm/0.25 μm, 50. C @ 2. min, 4. K/min, 280. C @ 20. min |

References

Weast and Grasselli, 1989
CRC Handbook of Data on Organic Compounds, 2nd Editon, Weast,R.C and Grasselli, J.G., ed(s)., CRC Press, Inc., Boca Raton, FL, 1989, 1. [all data]
Blades, Blades, et al., 1954
Blades, H.; Blades, A.; Steacie, E.W.R.,
The Kinetics of Pyrolysis of Toluene,
Can. J. Chem., 1954, 32, 298-311. [all data]
Carnelley, 1880
Carnelley, T.,
J. Chem. Soc., 1880, 37, 701. [all data]
Carnelley, 1877
Carnelley, T.,
J. Chem. Soc., 1877, 32, 653. [all data]
Kusakov, et al., 1963
Kusakov, M.M., et al.,
Ultraviolet Absorption Spectra of Aromatic Hydrocarbons, 1963, 190. [all data]
Kríz, Popl, et al., 1974
Kríz, J.; Popl, M.; Mostecký, J.,
Retention indices of biphenyls and diphenylalkanes,
J. Chromatogr., 1974, 97, 1, 3-13, https://doi.org/10.1016/S0021-9673(01)97577-6
. [all data]
Piao, Chu, et al., 1999
Piao, M.; Chu, S.; Zheng, M.; Xu, X.,
Characterization of the combustion products of polyethylene,
Chemosphere, 1999, 39, 9, 1497-1512, https://doi.org/10.1016/S0045-6535(99)00054-5
. [all data]