Naphthalene, 1-(2-naphthalenylmethyl)-
- Formula: C21H16
- Molecular weight: 268.3517
- IUPAC Standard InChIKey: GPCYJQRKJVLCBS-UHFFFAOYSA-N
- CAS Registry Number: 611-48-3
- Chemical structure:
View 3d structure (requires JavaScript / HTML 5) - Other names: Methane, 1-naphthyl-2-naphthyl-; (1-Naphthyl)(2-naphthyl)methane; 1,2'-Dinaphthylmethane

Condensed phase thermochemistry data

Data compiled by: Hussein Y. Afeefy, Joel F. Liebman, and Stephen E. Stein
Quantity | Value | Units | Method | Reference | Comment |
---|---|---|---|---|---|
ΔfH°solid | 162.0 ± 1.9 | kJ/mol | Ccb | Good, 1978 | |
ΔfH°solid | 162.0 ± 1.9 | kJ/mol | Ccb | Douslin, Scott, et al., 1976 | crystal phase |
Quantity | Value | Units | Method | Reference | Comment |
ΔcH°solid | -10712.4 ± 1.7 | kJ/mol | Ccb | Good, 1978 | Corresponding ΔfHºsolid = 162.00 kJ/mol (simple calculation by NIST; no Washburn corrections) |
ΔcH°solid | -10712.4 ± 1.7 | kJ/mol | Ccb | Douslin, Scott, et al., 1976 | crystal phase; Corresponding ΔfHºsolid = 162.1 kJ/mol (simple calculation by NIST; no Washburn corrections) |

Phase change data

Data compiled as indicated in comments:
TRC - Thermodynamics Research Center, NIST Boulder Laboratories, Chris Muzny director
AC - William E. Acree, Jr., James S. Chickos

Quantity Value Units Method Reference Comment
Ttriple369.540KN/AFinke, Messerly, et al., 1977Uncertainty assigned by TRC = 0.02 K; TRC

Enthalpy of fusion

ΔfusH (kJ/mol) Temperature (K) Reference Comment
30.54369.6Domalski and Hearing, 1996AC

In addition to the Thermodynamics Research Center (TRC) data available from this site, much more physical and chemical property data is available from the following TRC products:

References

Good, 1978
Good, W.D.,
The enthalpies of formation of some bridged-ring polynuclear aromatic hydrocarbons,
J. Chem. Thermodyn., 1978, 10, 553-558. [all data]
Douslin, Scott, et al., 1976
Douslin, D.R.; Scott, D.W.; Good, W.D.; Osborn, A.G.,
Thermodynamic properties of organic compounds and thermodynamic properties of fluids,
Gov. Rep. Announce. Index U.S., 1976, 76, 97. [all data]