1,1'-Biphenyl, 2,3'-dimethyl-
- Formula: C14H14
- Molecular weight: 182.2610
- IUPAC Standard InChIKey: UZQLBACCROFUKQ-UHFFFAOYSA-N
- CAS Registry Number: 611-43-8
- Chemical structure:
View 3d structure (requires JavaScript / HTML 5) - Other names: m,o'-Bitolyl; o,m'-Bitolyl; o,m'-Ditolyl; 2,3'-Dimethylbiphenyl; 2,3'-Ditolyl; 3,2'-Ditolyl

Phase change data

Data compiled by: Thermodynamics Research Center, NIST Boulder Laboratories, Chris Muzny director
Quantity | Value | Units | Method | Reference | Comment |
---|---|---|---|---|---|
Tboil | 546. | K | N/A | Blades, Blades, et al., 1954 | Uncertainty assigned by TRC = 8. K |
Tboil | 539. | K | N/A | Koelsch, 1932 | Uncertainty assigned by TRC = 5. K |
Tboil | 548. | K | N/A | Mayer and Freitak, 1921 | Uncertainty assigned by TRC = 4. K |
Tboil | 543. | K | N/A | Schultz, 1884 | Uncertainty assigned by TRC = 5. K |

Kovats' RI, non-polar column, isothermal

Column type | Active phase | Temperature (C) | I | Reference | Comment |
---|---|---|---|---|---|
Packed | Apiezon L | 170. | 1446. | Kríz, Popl, et al., 1974 | |
Packed | Apiezon L | 185. | 1458. | Kríz, Popl, et al., 1974 |

Kovats' RI, polar column, isothermal

Column type | Active phase | Temperature (C) | I | Reference | Comment |
---|---|---|---|---|---|
Capillary | SP-1000 | 185. | 2074. | Kríz, Popl, et al., 1974 | N2; Column length: 50. m; Column diameter: 0.25 mm |
Capillary | SP-1000 | 200. | 2037. | Kríz, Popl, et al., 1974 | N2; Column length: 50. m; Column diameter: 0.25 mm |

References

Blades, Blades, et al., 1954
Blades, H.; Blades, A.; Steacie, E.W.R.,
The Kinetics of Pyrolysis of Toluene,
Can. J. Chem., 1954, 32, 298-311. [all data]
Koelsch, 1932
Koelsch, C.F.,
J. Am. Chem. Soc., 1932, 54, 4744. [all data]
Mayer and Freitak, 1921
Mayer, F.; Freitak, K.,
Chem. Ber., 1921, 54, 347. [all data]
Schultz, 1884
Schultz, G.,
Chem. Ber., 1884, 17, 463. [all data]
Kríz, Popl, et al., 1974
Kríz, J.; Popl, M.; Mostecký, J.,
Retention indices of biphenyls and diphenylalkanes,
J. Chromatogr., 1974, 97, 1, 3-13, https://doi.org/10.1016/S0021-9673(01)97577-6
. [all data]