Cyclohexane, (1,2-dimethylbutyl)-
- Formula: C12H24
- Molecular weight: 168.3190
- IUPAC Standard InChIKey: KRDFMOZMKWQTEB-UHFFFAOYSA-N
- CAS Registry Number: 61142-37-8
- Chemical structure:
View 3d structure (requires JavaScript / HTML 5) - Permanent link for this species. Use this link for bookmarking this species for future reference.

Phase change data

Data compiled by: Thermodynamics Research Center, NIST Boulder Laboratories, Chris Muzny director
Quantity | Value | Units | Method | Reference | Comment |
---|---|---|---|---|---|
Tboil | 480. | K | N/A | Halse, 1915 | Uncertainty assigned by TRC = 4. K |

References

Halse, 1915
Halse, O.M.,
J. Prakt. Chem., 1915, 92, 40. [all data]