Cyclobutane, 1,2-diethyl-

Reaction thermochemistry data

Data compiled by: Hussein Y. Afeefy, Joel F. Liebman, and Stephen E. Stein

Individual Reactions

3Hydrogen + 1,2-Divinylcyclobutene = Cyclobutane, 1,2-diethyl-

By formula: 3H2 + C8H10 = C8H16

Quantity Value Units Method Reference Comment
Δr-341.kJ/molChydRoth, Scholz, et al., 1982liquid phase

References

Roth, Scholz, et al., 1982
Roth, W.R.; Scholz, B.P.; Breuckmann, R.; Jelich, K.; Lennartz, H.W., Thermolysis of 1,2,6,7-octatetraene, Chem. Ber., 1982, 115, 1934-1946. [all data]