(Dinitromethyl)benzene

Phase change data

Data compiled as indicated in comments:
ALS - Hussein Y. Afeefy, Joel F. Liebman, and Stephen E. Stein
AC - William E. Acree, Jr., James S. Chickos

Quantity Value Units Method Reference Comment
Δsub76.1 ± 0.8kJ/molVPepekin, Matyushin, et al., 1972ALS

Enthalpy of sublimation

ΔsubH (kJ/mol) Temperature (K) Method Reference Comment
76.1317.5AStephenson and Malanowski, 1987Based on data from 312. - 323. K.; AC

References

Pepekin, Matyushin, et al., 1972
Pepekin, V.I.; Matyushin, Yu.N.; Rozantsev, G.G.; Shevelev, S.A.; Apin, A.Ya., Enthalpies of formation of dinitrophenylmethane, trinitrophenylethane, and fluorodinitrophenylamine, Bull. Acad. Sci. USSR, Div. Chem. Sci., 1972, 2634-2636. [all data]

Stephenson and Malanowski, 1987
Stephenson, Richard M.; Malanowski, Stanislaw, Handbook of the Thermodynamics of Organic Compounds, 1987, https://doi.org/10.1007/978-94-009-3173-2 . [all data]