Benzene, 2,4-dichloro-1-nitro-
- Formula: C6H3Cl2NO2
- Molecular weight: 192.000
- IUPAC Standard InChIKey: QUIMTLZDMCNYGY-UHFFFAOYSA-N
- CAS Registry Number: 611-06-3
- Chemical structure:
View 3d structure (requires JavaScript / HTML 5) - Other names: 2,4-Dichloro-1-nitrobenzene; 2,4-Dichloronitrobenzene; 1,3-Dichloro-4-nitrobenzene; Benzene, 1,3-dichloro-4-nitro

Phase change data

Data compiled as indicated in comments:
BS - Robert L. Brown and Stephen E. Stein
TRC - Thermodynamics Research Center, NIST Boulder Laboratories, Chris Muzny director
AC - William E. Acree, Jr., James S. Chickos
Quantity | Value | Units | Method | Reference | Comment |
---|---|---|---|---|---|
Tboil | 531.7 | K | N/A | Weast and Grasselli, 1989 | BS |
Quantity | Value | Units | Method | Reference | Comment |
Tfus | 305. | K | N/A | Buechner, 1906 | Uncertainty assigned by TRC = 1.5 K; TRC |
Quantity | Value | Units | Method | Reference | Comment |
ΔsubH° | 87.8 ± 1.7 | kJ/mol | C | Ribeiro da Silva, Lobo Ferreira, et al., 2009 | AC |

References

Weast and Grasselli, 1989
CRC Handbook of Data on Organic Compounds, 2nd Editon, Weast,R.C and Grasselli, J.G., ed(s)., CRC Press, Inc., Boca Raton, FL, 1989, 1. [all data]
Buechner, 1906
Buechner, E.H.,
Z. Phys. Chem., Stoechiom. Verwandtschaftsl., 1906, 54, 665. [all data]
Ribeiro da Silva, Lobo Ferreira, et al., 2009
Ribeiro da Silva, Manuel A.V.; Lobo Ferreira, Ana I.M.C.; Moreno, Ana Rita G.,
Experimental and computational thermochemical study of the dichloronitrobenzene isomers,
The Journal of Chemical Thermodynamics, 2009, 41, 8, 904-910, https://doi.org/10.1016/j.jct.2009.03.001
. [all data]