ortho-Hydroxypropiophenone
- Formula: C9H10O2
- Molecular weight: 150.1745
- IUPAC Standard InChIKey: KDUWXMIHHIVXER-UHFFFAOYSA-N
- CAS Registry Number: 610-99-1
- Chemical structure:
View 3d structure (requires JavaScript / HTML 5) - Other names: o-Hydroxypropiophenone; 2'-Hydroxypropiophenone; 2-Hydroxyphenyl ethyl ketone; 1-Propanone, 1-(2-hydroxyphenyl)-; o-Propiophenol; Propiophenone, 2'-hydroxy-; 2-Propionylphenol; Propiophenone, o-hydroxy-

Phase change data

Data compiled by: Robert L. Brown and Stephen E. Stein
Reduced pressure boiling point
Tboil (K) | Pressure (atm) | Reference |
---|---|---|
423.2 | 0.11 | Weast and Grasselli, 1989 |
388.2 | 0.020 | Weast and Grasselli, 1989 |

References

Weast and Grasselli, 1989
CRC Handbook of Data on Organic Compounds, 2nd Editon, Weast,R.C and Grasselli, J.G., ed(s)., CRC Press, Inc., Boca Raton, FL, 1989, 1. [all data]