Benzene, 1-ethoxy-2,4-dinitro-
- Formula: C8H8N2O5
- Molecular weight: 212.1595
- IUPAC Standard InChIKey: YSOKMOXAGMIZFZ-UHFFFAOYSA-N
- CAS Registry Number: 610-54-8
- Chemical structure:
View 3d structure (requires JavaScript / HTML 5) - Other names: 2,4-Dinitrophenetole; 2,4-Dinitrophenyl ethyl ether; 1-Ethoxy-2,4-dinitrobenzene; Phenetole, 2,4-dinitro-; 2,4-Dinitro-1-ethoxy-benzene; 2,4-Dinitrofenetol

Condensed phase thermochemistry data

Data compiled by: Hussein Y. Afeefy, Joel F. Liebman, and Stephen E. Stein
Quantity | Value | Units | Method | Reference | Comment |
---|---|---|---|---|---|
ΔcH°solid | -4064.1 ± 4.1 | kJ/mol | Ccb | Badoche, 1942 | Reanalyzed by Cox and Pilcher, 1970, Original value = -4067.2 kJ/mol |
ΔcH°solid | -4065.9 ± 4.1 | kJ/mol | Ccb | Burlot, 1939 | Reanalyzed by Cox and Pilcher, 1970, Original value = -4076.7 ± 4.1 kJ/mol; At 18 C |

References

Badoche, 1942
Badoche, M.,
Chaleurs de combustion de derives nitres phenoliques,
Bull. Soc. Chim. France, 1942, 9, 86-95. [all data]
Cox and Pilcher, 1970
Cox, J.D.; Pilcher, G.,
Thermochemistry of Organic and Organometallic Compounds, Academic Press, New York, 1970, 1-636. [all data]
Burlot, 1939
Burlot, E.,
Etude relative a la calorimetrie des explosifs,
Mem. Poudres, 1939, 29, 226-260. [all data]