Anthracene, 1-methyl-
- Formula: C15H12
- Molecular weight: 192.2558
- IUPAC Standard InChIKey: KZNJSFHJUQDYHE-UHFFFAOYSA-N
- CAS Registry Number: 610-48-0
- Chemical structure:
View 3d structure (requires JavaScript / HTML 5) - Other names: 1-Methylanthracene; 4-Methylanthracene

Phase change data

Data compiled as indicated in comments:
BS - Robert L. Brown and Stephen E. Stein
AC - William E. Acree, Jr., James S. Chickos
Quantity | Value | Units | Method | Reference | Comment |
---|---|---|---|---|---|
Tboil | 636.2 | K | N/A | Aldrich Chemical Company Inc., 1990 | BS |
Quantity | Value | Units | Method | Reference | Comment |
ΔvapH° | 87.0 ± 1.0 | kJ/mol | CGC | Hanshaw, Nutt, et al., 2008 | AC |

Lee's RI, non-polar column, temperature ramp

Data compiled by: NIST Mass Spectrometry Data Center, William E. Wallace, director

Column type CapillaryCapillaryCapillaryCapillaryCapillary
Active phase HP-5HP-55 % Phenyl methyl siloxaneHP-5SE-54
Column length (m) 30.30. 30.25.
Carrier gas HeliumHe  He
Substrate
Column diameter (mm) 0.300.3 0.25
Phase thickness (μm) 0.250.25 0.25
Tstart (C) 50.50.50.50.130.
Tend (C) 200.200.250.280.260.
Heat rate (K/min) 5.5.2.4.3.
Initial hold (min) 5.5. 2.
Final hold (min) 15.15. 20.40.
I 315.9316.323.33323.38322.20
ReferenceWang, Hou, et al., 2007Shao, Wang, et al., 2006Skrbic and Onjia, 2006Piao, Chu, et al., 1999Ivanov and Golovko, 1994
Comment MSDC-RI MSDC-RI MSDC-RI MSDC-RI MSDC-RI
Column type CapillaryCapillaryCapillary
Active phase DB-5DB-5SE-52
Column length (m) 30.30.12.
Carrier gas  HeliumHe
Substrate
Column diameter (mm) 0.320.320.3
Phase thickness (μm)   0.34
Tstart (C) 80.90.50.
Tend (C) 300.250.250.
Heat rate (K/min) 3.54.2.
Initial hold (min) 1.
Final hold (min) 10.
I 323.3327.7323.33
ReferencePalmentier, Britten, et al., 1989Viau, Studak, et al., 1984Lee, Vassilaros, et al., 1979
Comment MSDC-RI MSDC-RI MSDC-RI

References

Aldrich Chemical Company Inc., 1990
Aldrich Chemical Company Inc.,
Catalog Handbook of Fine Chemicals, Aldrich Chemical Company, Inc., Milwaukee WI, 1990, 1. [all data]
Hanshaw, Nutt, et al., 2008
Hanshaw, William; Nutt, Marjorie; Chickos, James S.,
Hypothetical Thermodynamic Properties. Subcooled Vaporization Enthalpies and Vapor Pressures of Polyaromatic Hydrocarbons,
J. Chem. Eng. Data, 2008, 53, 8, 1903-1913, https://doi.org/10.1021/je800300x
. [all data]