Methyl Z,Z 13,16-docosadienoate

Phase change data

Data compiled by: William E. Acree, Jr., James S. Chickos

Quantity Value Units Method Reference Comment
Δvap30.57kcal/molCGCLipkind, Kapustin, et al., 2007

References

Lipkind, Kapustin, et al., 2007
Lipkind, Dmitry; Kapustin, Yaroslav; Umnahanant, Patamaporn; Chickos, James S., The vaporization enthalpies and vapor pressures of a series of unsaturated fatty acid methyl esters by correlation gas chromatography, Thermochimica Acta, 2007, 456, 2, 94-101, https://doi.org/10.1016/j.tca.2007.02.008 . [all data]