Acepromazine
- Formula: C19H22N2OS
- Molecular weight: 326.456
- IUPAC Standard InChIKey: NOSIYYJFMPDDSA-UHFFFAOYSA-N
- CAS Registry Number: 61-00-7
- Chemical structure:
View 3d structure (requires JavaScript / HTML 5) - Other names: Ethanone, 1-[10-[3-(dimethylamino)propyl]-10H-phenothiazin-2-yl]-; Ketone, 10-[3-(dimethylamino)propyl]phenothiazin-2-yl methyl; Acepromazin; Acetacin; Acetazin; Acetazine; Acetopromazine; Acetylpromazine; Azapromazine; Azepromazine; Notensil; Plegicil; Plivafen; Vetranquil; 10-(3-Dimethylaminopropyl)phenothiazin-3-yl methyl ketone; 1522 C. B.; 1522CB; 2-Acetyl-10-[3-(Dimethylamino)propyl]phenylthiazine; 2-Acetylpromazine; 3-Acetyl-10-(3-dimethylaminopropyl)phenothiazine; Acepromazina; Acepromizina; Acetilpromazina; 2-Acetyl-10-(3-dimethylaminopropyl)phenothiazine; Acetylpromazin; 3-Acetyl-promazin; Atsetozin; AY-57,062; 10-(3-Dimethylaminopropyl)phenothiazine-3-ethanone; 1-(10-(3-(Dimethylamino)propyl)-10H-phenothiazin-2-yl)ethanone; Plivaphen; Promazine, acetyl-; SV-1522; Vetranquill; WY-1172; 10-[3-(Dimethylamino)propyl]-10H-phenothiazin-2-yl methyl ketone

Kovats' RI, non-polar column, isothermal

Column type | Active phase | Temperature (C) | I | Reference | Comment |
---|---|---|---|---|---|
Capillary | SPB-1 | 250. | 2720. | Lora-Tamayo, Rams, et al., 1986 | He; Column length: 25. m; Column diameter: 0.20 mm |

Normal alkane RI, non-polar column, isothermal

Column type | Active phase | Temperature (C) | I | Reference | Comment |
---|---|---|---|---|---|
Packed | OV-1 | 240. | 2713. | Courtot, 1976 | Supelcoport (100-120 mesh); Column length: 2. m |
Packed | OV-1 | 260. | 2735. | Courtot, 1976 | Supelcoport (100-120 mesh); Column length: 2. m |

Normal alkane RI, non-polar column, temperature ramp

Column type | Active phase | I | Reference | Comment |
---|---|---|---|---|
Packed | SE-30 | 2694. | MHA, 9999 | Nitrogen, Chromosorb G AW DMCS (80-100 mesh); Column length: 2. m; Tstart: 100. C; Tend: 300. C |
Packed | SE-30 | 2720. | Marozzi, Gambaro, et al., 1982 | Gas Chrom P, 5. K/min; Column length: 2. m; Tstart: 150. C; Tend: 300. C |

Normal alkane RI, non-polar column, custom temperature program

Column type | Active phase | I | Reference | Comment |
---|---|---|---|---|
Other | Methyl Silicone | 2694. | Ardrey and Moffat, 1981 | Program: not specified |

Phase change data

Data compiled by: Robert L. Brown and Stephen E. Stein

Reduced pressure boiling point

Tboil (K) Pressure (bar) Reference
488. - 490.0.0007Buckingham and Donaghy, 1982
481. - 483.0.0001Buckingham and Donaghy, 1982

References

Kracmar, et al., 1986
Kracmar, J., et al.,
Die Pharmazie, 1986, 41, 571. [all data]
Lora-Tamayo, Rams, et al., 1986
Lora-Tamayo, C.; Rams, M.A.; Chacon, J.M.R.,
Gas Chromatographic Data for 187 Nitrogen- or Phosphorus-Containing Drugs and Metabolites of Toxicological Interest Analysed on Methyl Silicone Capillary Columns,
J. Chromatogr., 1986, 374, 73-85, https://doi.org/10.1016/S0378-4347(00)83254-5
. [all data]
Courtot, 1976
Courtot, D.,
Research and identification of tranquillizers - use of retention index,
J. Sports Med., 1976, 10, 3, 143-146, https://doi.org/10.1136/bjsm.10.3.143
. [all data]
MHA, 9999
MHA, Directorate of ForensicScience.,
Forensic Toxicology, 9999. [all data]
Marozzi, Gambaro, et al., 1982
Marozzi, E.; Gambaro, V.; Saligari, E.; Mariani, R.; Lodi, F.,
Use of the retention index in gas chromatographic studies of drugs,
J. Anal. Toxicol., 1982, 6, 4, 185-192, https://doi.org/10.1093/jat/6.4.185
. [all data]
Ardrey and Moffat, 1981
Ardrey, R.E.; Moffat, A.C.,
Gas-liquid chromatographic retention indices of 1318 substances of toxicological interest on SE-30 or OV-1 stationary phase,
J. Chromatogr., 1981, 220, 3, 195-252, https://doi.org/10.1016/S0021-9673(00)81925-1
. [all data]