3-Methoxycinnamic acid
- Formula: C10H10O3
- Molecular weight: 178.1846
- IUPAC Standard InChIKey: LZPNXAULYJPXEH-AATRIKPKSA-N
- CAS Registry Number: 6099-04-3
- Chemical structure:
View 3d structure (requires JavaScript / HTML 5) - Species with the same structure:
- Other names: trans-3-Methoxycinnamic acid; m-Methoxycinnamic acid; 2-Propenoic acid, 3-(3-methoxyphenyl)-; Cinnamic acid, m-methoxy-; 3-(3-Methoxyphenyl)acrylic acid; Propenoic acid, 3-(3-methoxyphenyl)-, trans-

Phase change data

Data compiled by: William E. Acree, Jr., James S. Chickos
Enthalpy of fusion
ΔfusH (kJ/mol) | Temperature (K) | Method | Reference |
---|---|---|---|
22.58 | 390.5 | DSC | Huang, Chen, et al., 1994 |

References

Huang, Chen, et al., 1994
Huang, Wei-Jun; Chen, Su-Ming; Tan, Fu; Yang, Zhen-Xiang,
Study on Thermodynamic Characteristics of Cinnamic Acid Derivatives,
Acta Phys. Chim. Sin., 1994, 10, 2, 151-153, https://doi.org/10.3866/PKU.WHXB19940212
. [all data]