dl-Proline
- Formula: C5H9NO2
- Molecular weight: 115.1305
- IUPAC Standard InChIKey: ONIBWKKTOPOVIA-UHFFFAOYSA-N
- CAS Registry Number: 609-36-9
- Chemical structure:
- Other names: 2-Pyrrolidine carboxylic acid; Proline, DL-

Condensed phase thermochemistry data

Data compiled by: Hussein Y. Afeefy, Joel F. Liebman, and Stephen E. Stein
Quantity | Value | Units | Method | Reference | Comment |
---|---|---|---|---|---|
ΔcH°solid | -2729.6 ± 0.54 | kJ/mol | Ccb | Ponomarev and Migarskaya, 1960 | Reanalyzed by Cox and Pilcher, 1970, Original value = -2728.9 ± 0.1 kJ/mol |

Ion clustering data

Data compiled as indicated in comments:
M - Michael M. Meot-Ner (Mautner) and Sharon G. Lias
RCD - Robert C. Dunbar
Clustering reactions
By formula: C5H10NO2+ + C5H9NO2 = (C5H10NO2+ • C5H9NO2)
Quantity | Value | Units | Method | Reference | Comment |
---|---|---|---|---|---|
ΔrH° | 120. | kJ/mol | PHPMS | Meot-Ner, Hunter, et al., 1979 | gas phase; M |
ΔrH° | 84. | kJ/mol | PHPMS | Meot-Ner and Field, 1974 | gas phase; M |
Quantity | Value | Units | Method | Reference | Comment |
ΔrS° | 130. | J/mol*K | PHPMS | Meot-Ner, Hunter, et al., 1979 | gas phase; M |
By formula: Na+ + C5H9NO2 = (Na+ • C5H9NO2)
Quantity | Value | Units | Method | Reference | Comment |
---|---|---|---|---|---|
ΔrH° | 175. ± 13. | kJ/mol | IMRE | Gapeev and Dunbar, 2003 | Anchor glycine=38.5+-2.3; RCD |
ΔrH° | 196. | kJ/mol | CIDC | Kish, Ohanessian, et al., 2003 | Anchor alanine=39.89; RCD |

References

Ponomarev and Migarskaya, 1960
Ponomarev, V.V.; Migarskaya, L.B.,
Heats of combustion of some amino-acids,
Russ. J. Phys. Chem. (Engl. Transl.), 1960, 34, 1182-1183. [all data]
Cox and Pilcher, 1970
Cox, J.D.; Pilcher, G.,
Thermochemistry of Organic and Organometallic Compounds, Academic Press, New York, 1970, 1-636. [all data]
Meot-Ner, Hunter, et al., 1979
Meot-Ner, (Mautner); Hunter, E.P.; Field, F.H.,
Ion Thermochemistry of Low Volatility Compounds in the Gas Phase. I. Intrinsic Basicities of Alpha - Amino Acids,
J. Am. Chem. Soc., 1979, 101, 3, 686, https://doi.org/10.1021/ja00497a034
. [all data]
Meot-Ner and Field, 1974
Meot-Ner, (Mautner); Field, F.H.,
Solvation and Association of Protonated Gaseous Amino Acids,
J. Am. Chem. Soc., 1974, 96, 10, 3168, https://doi.org/10.1021/ja00817a024
. [all data]
Gapeev and Dunbar, 2003
Gapeev, A.; Dunbar, R.C.,
Na+ Affinities of Gas-Phase Amino Acids by Ligand Exchange Equilibrium,
Int. J. Mass Spectrom., 2003, 228, 2-3, 825, https://doi.org/10.1016/S1387-3806(03)00242-2
. [all data]
Kish, Ohanessian, et al., 2003
Kish, M.M.; Ohanessian, G.; Wesdemiotis, C.,
The Na+ affinities of a-amino acids: side-chain substituent effects,
Int. J. Mass Spectrom., 2003, 227, 3, 509, https://doi.org/10.1016/S1387-3806(03)00082-4
. [all data]