3-Ethyl-2-pentanol
- Formula: C7H16O
- Molecular weight: 116.2013
- IUPAC Standard InChIKey: NEHRITNOSGFGGS-UHFFFAOYSA-N
- CAS Registry Number: 609-27-8
- Chemical structure:
View 3d structure (requires JavaScript / HTML 5) - Other names: 2-Pentanol, 3-ethyl-

Phase change data

Data compiled by: Thermodynamics Research Center, NIST Boulder Laboratories, Chris Muzny director
Quantity | Value | Units | Method | Reference | Comment |
---|---|---|---|---|---|
Tboil | 422.15 | K | N/A | Colonge, 1927 | Uncertainty assigned by TRC = 3. K |

References

Colonge, 1927
Colonge, J.,
The condensation of ethanol with methyl-n-propyl ketone,
Bull. Soc. Chim. Fr., 1927, 41, 325. [all data]