Hexyl chloroformate
- Formula: C7H13ClO2
- Molecular weight: 164.630
- IUPAC Standard InChIKey: KIWBRXCOTCXSSZ-UHFFFAOYSA-N
- CAS Registry Number: 6092-54-2
- Chemical structure:
View 3d structure (requires JavaScript / HTML 5) - Other names: Carbonochloridic acid, hexyl ester; Hexyl chloridocarbonate

Phase change data

Data compiled by: Robert L. Brown and Stephen E. Stein
Reduced pressure boiling point
Tboil (K) | Pressure (bar) | Reference |
---|---|---|
333.7 | 0.009 | Aldrich Chemical Company Inc., 1990 |

Van Den Dool and Kratz RI, non-polar column, custom temperature program

Column type | Active phase | I | Reference | Comment |
---|---|---|---|---|
Capillary | VF-5MS | 1055. | Tretyakov, 2011 | 30. m/0.25 mm/0.25 μm, He; Program: Multi-step temperature program; T(initial)=60C; T(final)=270C |

References

Aldrich Chemical Company Inc., 1990
Aldrich Chemical Company Inc.,
Catalog Handbook of Fine Chemicals, Aldrich Chemical Company, Inc., Milwaukee WI, 1990, 1. [all data]
Tretyakov, 2011
Tretyakov, K.V.,
Retention Data. NIST Mass Spectrometry Data Center., NIST Mass Spectrometry Data Center, 2011. [all data]